program: Gaussian 09
title: 000231278
version: EM64L-G09RevD.01
frameworkgroup: C1[X(C14H12N2O3)]
method: RPBEPBE
basis: SDD
operation: Freq
keyword: #p
keyword: freq=noraman
keyword: PBEPBE/SDD
title: #p freq=noraman PBEPBE/SDD
converged: NO NO NO NO
title: Mulliken charges:
elementType: O O O N N C C C C C C C C C C C C C C H H H H H H H H H H H H
charge: -0.275150 -0.443361 -0.259454 -0.503245 -0.503045 0.487181 -0.443889 -0.318356 0.477356 0.264120 -0.337871 -0.326341 0.277429 -0.446194 -0.331095 -0.196826 -0.213626 -0.255934 0.103555 0.219724 0.309912 0.292666 0.271035 0.273402 0.290395 0.213793 0.305608 0.227280 0.227760 0.230510 0.382660
chargesum: 0.00000
title: Mulliken charges with hydrogens summed into heavy atoms:
elementType: O O O N N C C C C C C C C C C C C C C
charge: -0.275150 -0.060701 -0.259454 -0.210579 -0.212650 0.487181 -0.224165 -0.008444 0.477356 0.264120 -0.066836 -0.052939 0.277429 -0.232401 -0.025487 0.030454 0.014134 -0.025424 0.103555
polarizability: 3.66517679e+02 7.90599149e-01 1.74060238e+02 -6.40847683e-04 -6.27894708e-03 6.77115784e+01
1716.lowfreq: -0.0008 -0.0001 0.0006 3.2534 5.1278 19.8447 25.9440 31.9897 58.7751
frequency: 25.9411 31.9177 58.7720 67.6666 73.7656 85.7288 129.9219 151.0351 192.8137 230.3302 231.3695 285.0299 340.7628 353.0941 389.2885 407.7351 413.9119 444.0875 486.7798 506.2209 532.1183 541.2762 583.1969 609.7499 614.4861 623.2730 628.2543 686.7616 696.3296 698.5617 718.8348 760.6506 766.7865 766.9847 801.0121 838.7889 840.7577 880.5506 881.1993 915.7878 972.1616 979.9631 982.4221 992.6262 997.9604 999.9431 1008.3306 1021.3618 1030.1377 1090.6913 1125.4259 1150.7616 1171.6945 1173.0333 1189.5267 1197.5326 1249.0588 1280.9985 1310.5844 1318.8461 1323.1905 1370.8286 1383.4873 1425.7575 1430.0580 1484.5503 1497.5241 1506.7784 1519.8970 1586.7455 1602.1622 1615.4884 1622.3492 1637.9566 1660.5029 3100.2500 3111.4089 3132.1662 3143.7134 3162.1815 3165.1629 3171.5326 3200.6485 3202.9904 3518.6227 3530.5493 3534.1226
redmass: 6.1436 4.6298 6.3974 8.7481 5.2759 5.9033 4.6526 6.6207 8.1878 5.7759 3.1472 4.0430 8.5406 5.8186 8.1238 2.9307 2.9298 1.5991 6.3072 2.6682 2.3646 6.5262 1.2280 5.5416 6.2423 1.1923 7.1017 3.6897 2.0267 10.4625 5.5699 4.4382 7.0452 1.6882 6.0471 1.3858 1.2905 5.7482 1.5028 1.4222 1.3510 1.3620 6.2070 5.5306 5.3062 1.3048 1.3286 2.7450 2.1405 1.5659 1.3458 1.6316 2.7198 1.0520 1.1124 1.1829 2.2011 1.8625 1.5087 1.8332 2.1886 4.1360 6.4573 4.0015 2.5540 2.3734 2.0444 2.5629 2.3819 4.8882 5.1879 6.0115 5.8548 8.4892 4.1657 1.0892 1.0898 1.0866 1.0932 1.0947 1.0999 1.0911 1.0946 1.0952 1.0766 1.0755 1.0642
irintensity: 0.3087 0.4347 0.3375 5.2383 5.6511 0.5305 1.9793 5.5255 0.0450 4.4306 1.8435 0.2879 2.1082 0.8595 28.3586 0.0037 0.7767 0.9277 10.3201 90.4763 0.9528 8.6280 70.4901 24.8632 12.9958 103.3876 0.9763 71.8198 64.9140 9.9932 2.0967 13.3996 0.2877 106.3590 0.8291 24.5258 5.8213 1.1074 55.2466 15.6193 0.1891 0.2816 10.8249 184.4741 31.6594 2.7884 1.2596 167.8366 32.6396 15.5901 15.6234 247.6704 384.4512 1.6094 4.1880 3.4830 249.7731 8.2074 73.4467 260.3719 44.7881 130.2090 143.3900 37.1768 109.3152 309.4266 433.8759 782.1869 34.3987 24.9921 47.2775 92.3487 242.8064 275.4887 122.5396 18.8686 18.0582 0.0307 28.6369 3.7291 28.4544 0.6763 8.4419 4.5193 4.6935 22.1006 52.7870
temp: 298.150 k
press: 1.00000 atm
elementType: 8 8 8 7 7 6 6 6 6 6 6 6 6 6 6 6 6 6 6 1 1 1 1 1 1 1 1 1 1 1 1
symmnumber: 1
zpe: 617124.8 jmol-1
zpe.correction: 0.235050 hartree
zpe.thermalcorrener: 0.251399 hartree
zpe.thermalcorrenthalpy: 0.252343 hartree
zpe.thermalcorrgfe: 0.189142 hartree
zpe.sumelectzpe: -874.573184 hartree
zpe.sumelectthermal: -874.556835 hartree
zpe.sumelectthermalent: -874.555891 hartree
zpe.sumelectthermalfe: -874.619092 hartree
dipole: -3.4219 -3.0840 0.0002
dipole: 4.6065
quadrupole: -112.4055 -95.6911 -116.5953
quadrupole: 15.4657 -0.0015 -0.0006
quadrupole: -4.1749 12.5395 -8.3646 15.4657 -0.0015 -0.0006
hfenergy: -874.8082342 hartree
pointgroup: C01 [X(C14H12N2O3)]
dipole: 1.3388896 -1.2214599 -0.0000872 debye
polarizability: 366.5010401|-1.9562908|174.0768767|-0.0006028|0.0062827|67.7115784 unknown
InChI: InChI=1S/C14H12N2O3/c17-13(18)10-6-8-12(9-7-10)16-14(19)15-11-4-2-1-3-5-11/h1-9,15-17H
charge 0 multiplicity 1
31 atoms
O  1.056212 1.203453 0.000233
O  -5.934001 1.653304 0.000145
O  -6.513872 -0.598557 -0.000086
N  -0.00451 -0.907346 0.000051
N  2.325511 -0.785311 0.000044
C  -1.370211 -0.535904 0.000076
C  -2.327307 -1.593805 -0.000029
C  -1.819764 0.814756 0.000196
C  3.656838 -0.275522 0.000048
C  -4.154356 0.033837 0.000099
C  -3.700157 -1.312121 -0.000023
C  -3.200287 1.08419 0.000208
C  1.125935 -0.056558 0.000162
C  4.710412 -1.230893 0.000016
C  3.965855 1.110742 0.000064
C  6.05502 -0.809701 -0.000014
C  5.319028 1.515163 0.000044
C  6.369932 0.569752 0.0000
C  -5.615084 0.280952 0.000103
H  -1.987567 -2.638156 -0.000113
H  -1.0885 1.623613 0.000286
H  0.160091 -1.916397 -0.000081
H  -4.440172 -2.118857 -0.000103
H  -3.55151 2.119818 0.000305
H  2.26564 -1.80577 -0.000027
H  4.477074 -2.304722 0.000015
H  3.157476 1.84304 0.000116
H  6.854632 -1.558774 -0.000043
H  5.548885 2.586706 0.00006
H  7.414342 0.899138 -0.000021
H  -6.924082 1.745925 0.000067
