program: Gaussian 09
title: 000231273
version: EM64L-G09RevD.01
frameworkgroup: C1[X(C3H4Cl2O)]
method: RPBEPBE
basis: SDD
operation: Freq
keyword: #p
keyword: freq=noraman
keyword: PBEPBE/SDD
title: #p freq=noraman PBEPBE/SDD
converged: YES YES NO NO
title: Mulliken charges:
elementType: Cl Cl O C C C H H H H
charge: 0.036641 0.007999 -0.431389 -0.353573 0.011013 -0.336630 0.213602 0.238557 0.270248 0.343532
chargesum: 0.00000
title: Mulliken charges with hydrogens summed into heavy atoms:
elementType: Cl Cl O C C C
charge: 0.036641 0.007999 -0.087857 0.098586 0.281261 -0.336630
polarizability: 7.55849382e+01 -1.75939358e-01 5.80008045e+01 3.60870852e+00 -1.23858047e+00 3.12753584e+01
1716.lowfreq: -8.6389 -0.0043 -0.0032 -0.0027 4.8134 8.9721 66.7300 126.2005 193.9043
frequency: 66.7265 126.1974 193.9022 261.3001 352.9629 379.5896 415.5505 465.9742 575.6927 795.9019 833.0468 925.7689 975.2039 1080.1051 1161.9165 1245.4623 1318.2810 1368.8382 1462.4784 1638.5572 3003.3915 3076.5969 3142.3690 3557.4476
redmass: 3.6971 5.7518 3.2174 13.6984 1.6744 3.0674 6.1422 3.4052 5.3225 5.1817 1.3510 2.2157 3.3455 2.9882 1.1832 1.2340 1.1952 1.1924 1.0799 8.5650 1.0612 1.1022 1.0903 1.0665
irintensity: 4.9290 0.3670 7.0597 0.6447 111.9196 59.3291 8.6176 0.8246 21.9672 163.1809 21.3133 126.2988 15.5682 34.3703 22.6068 16.2458 22.3921 26.0329 6.9478 77.8626 33.3270 14.1701 3.5113 8.6935
temp: 298.150 k
press: 1.00000 atm
elementType: 17 17 8 6 6 6 1 1 1 1
symmnumber: 1
zpe: 170008.9 jmol-1
zpe.correction: 0.064753 hartree
zpe.thermalcorrener: 0.071846 hartree
zpe.thermalcorrenthalpy: 0.072790 hartree
zpe.thermalcorrgfe: 0.032144 hartree
zpe.sumelectzpe: -1111.540469 hartree
zpe.sumelectthermal: -1111.533376 hartree
zpe.sumelectthermalent: -1111.532432 hartree
zpe.sumelectthermalfe: -1111.573078 hartree
dipole: 0.1273 0.1433 -0.2862
dipole: 0.3445
quadrupole: -57.7022 -48.6188 -46.2750
quadrupole: 2.5439 -0.8368 -0.1268
quadrupole: -6.8369 2.2465 4.5903 2.5439 -0.8368 -0.1268
hfenergy: -1111.6052218 hartree
pointgroup: C01 [X(C3H4Cl2O1)]
dipole: -0.0482119 -0.0667059 -0.1076688 debye
dipolederiv: -0.6262231 -0.2816139 0.0793024 -0.3574781 -0.3993855 0.0504619 0.1245721 0.0532362 0.0054191 -0.1839558 0.0471079 0.025731 0.1182707 -0.7430981 0.0026455 0.0281861 -0.0014956 0.0067934 -0.7769987 -0.0800861 -0.244654 -0.1237868 -0.5116443 0.1166753 -0.352474 0.1156183 -0.3806401 0.655266 -0.070626 0.1742955 0.1756369 0.3174341 -0.0623712 0.2428611 -0.0784802 0.4584395 -0.4547033 0.0088643 -0.0406625 -0.0027024 -0.3048807 0.0141599 0.0067519 0.0513141 -0.1971241 1.0293757 0.1833096 -0.1781466 0.1370555 1.3679311 -0.0603294 -0.215963 -0.0632073 -0.1270581 0.034656 0.0853167 -0.0515789 -0.0014115 -0.1359216 0.0283629 -0.0296894 -0.014782 0.0559368 -0.0473945 0.0124697 0.0777348 -0.0033412 0.1026166 -0.0439381 0.0173912 -0.0084369 -0.074772 0.0831031 0.0255379 0.0188192 -0.0463746 -0.0177756 0.0049785 0.0402474 -0.0015992 0.1647385 0.2868746 0.0697198 0.1391591 0.1041315 0.324724 -0.0506454 0.1381166 -0.0521674 0.088267 unknown
polarizability: 75.5225734|0.3123633|58.0312169|-3.9492284|-0.9173278|31.3073107 unknown
InChI: InChI=1S/C3H4Cl2O/c4-3(5)1-2-6/h1,6H,2H2
charge 0 multiplicity 1
10 atoms
Cl 2.399761 1.053644 -0.188871
Cl 1.273893 -1.747384 0.02835
O  -2.627184 0.257278 -0.467746
C  -1.5827 -0.218848 0.457275
C  -0.297146 0.555847 0.265705
C  0.930767 0.030759 0.064208
H  -1.412835 -1.308179 0.359304
H  -2.003208 -0.015776 1.456785
H  -0.391831 1.648901 0.271621
H  -2.328716 0.096959 -1.399231
