program: Gaussian 09
title: 000231260
version: EM64L-G09RevD.01
frameworkgroup: C1[X(C13H8Cl2N2O4)]
method: RPBEPBE
basis: SDD
operation: Freq
keyword: #p
keyword: freq=noraman
keyword: PBEPBE/SDD
title: #p freq=noraman PBEPBE/SDD
converged: YES YES NO NO
title: Mulliken charges:
elementType: Cl Cl O O O O N N C C C C C C C C C C C C C H H H H H H H H
charge: -0.052557 -0.028456 -0.351345 -0.379450 -0.211458 -0.160822 -0.453379 0.013392 0.150516 0.065011 0.627074 0.254164 0.273704 -0.314782 -0.329913 -0.260821 -0.370189 -0.289940 -0.206141 -0.205754 -0.119149 0.323402 0.208080 0.288059 0.246146 0.329585 0.285137 0.264612 0.405274
chargesum: 0.00000
title: Mulliken charges with hydrogens summed into heavy atoms:
elementType: Cl Cl O O O O N N C C C C C C C C C C C C C
charge: -0.052557 -0.028456 0.053929 -0.379450 -0.211458 -0.160822 -0.129977 0.013392 0.150516 0.065011 0.627074 0.254164 0.273704 -0.106702 -0.041854 -0.014674 -0.370189 0.039644 0.078997 0.058858 -0.119149
polarizability: 3.72371279e+02 1.55517026e+01 2.07494263e+02 -2.56829318e+00 -3.58381154e+00 7.38785568e+01
1716.lowfreq: 0.0010 0.0011 0.0018 2.2349 5.4585 7.3583 17.4658 25.9129 45.0059
frequency: 17.1319 25.8735 45.0033 59.3415 64.7310 112.3741 136.9700 147.4239 162.1102 166.2355 180.7339 205.8727 237.6865 255.8687 340.3244 348.8377 362.7156 375.0617 397.8535 409.9099 440.1917 449.3758 464.3545 480.6001 521.9404 549.7095 580.4985 585.7084 634.9370 658.4096 674.5202 678.7984 710.3188 716.1014 722.1208 751.5337 779.9174 804.5402 832.3431 843.5623 846.8383 860.4407 905.4840 919.7442 970.5545 976.9407 986.0849 1017.2800 1083.0842 1093.0176 1104.5763 1145.0658 1168.1124 1195.2276 1214.2294 1235.2912 1272.3325 1282.9547 1299.6258 1342.4404 1367.8617 1372.0362 1393.8496 1407.4331 1427.4098 1456.3642 1470.2566 1524.1811 1563.4113 1578.1282 1590.4949 1606.8492 1642.1965 2663.6826 3124.2809 3167.8421 3175.1353 3185.8914 3186.5581 3201.8476 3494.0533
redmass: 8.0332 11.9585 12.8943 11.3897 7.7778 10.4830 5.6712 16.5258 11.8472 6.0565 5.0687 13.3784 9.7070 6.6766 6.0172 9.5883 7.7670 11.2296 7.3053 8.2939 3.5887 7.8857 6.8758 7.1702 3.2158 4.0169 6.7545 6.6136 7.4742 4.7627 1.9419 6.2805 7.4841 4.3710 4.5684 1.9014 8.8434 2.6024 6.5867 1.3641 5.9679 1.3866 7.1275 1.4234 1.0926 1.3708 1.2767 4.4305 2.3639 1.9505 5.5451 1.4026 2.0811 1.3328 6.1005 1.5510 2.5906 3.4074 2.2052 2.3705 7.6984 6.0893 5.4452 3.3194 3.4034 2.4354 2.9767 2.8308 5.5176 4.2303 3.8380 4.9669 3.8370 1.0726 1.0893 1.0903 1.0914 1.0983 1.0936 1.0952 1.0754
irintensity: 2.7390 0.0204 1.9566 0.9740 1.0894 1.6549 0.3625 1.2566 1.5691 0.1791 0.2973 1.3337 1.1303 0.1048 0.9667 1.8413 18.0771 8.5024 8.4290 6.3239 11.4710 16.0421 1.6803 33.5303 2.3560 16.5886 14.2553 9.5243 5.6152 4.0911 27.6277 34.4745 26.3205 16.8337 16.5834 94.8021 19.6442 13.9762 16.4535 46.8864 12.2378 22.1116 52.2934 0.8776 114.5661 1.5021 40.7337 27.3618 39.5515 15.9653 6.3514 28.7618 76.7134 44.1906 273.4661 17.3348 39.8062 26.2509 77.2351 284.8700 107.6799 83.3791 26.8424 90.8641 59.7934 124.4557 161.3874 801.2136 138.0699 130.0356 32.3360 25.6856 86.5279 779.7570 12.6741 4.8824 0.8814 4.2807 1.8413 12.8279 53.9769
temp: 298.150 k
press: 1.00000 atm
elementType: 17 17 8 8 8 8 7 7 6 6 6 6 6 6 6 6 6 6 6 6 6 1 1 1 1 1 1 1 1
symmnumber: 1
zpe: 499145.6 jmol-1
zpe.correction: 0.190115 hartree
zpe.thermalcorrener: 0.208280 hartree
zpe.thermalcorrenthalpy: 0.209224 hartree
zpe.thermalcorrgfe: 0.140917 hartree
zpe.sumelectzpe: -1829.163038 hartree
zpe.sumelectthermal: -1829.144873 hartree
zpe.sumelectthermalent: -1829.143929 hartree
zpe.sumelectthermalfe: -1829.212235 hartree
dipole: -5.2670 4.9689 -0.0956
dipole: 7.2416
quadrupole: -175.9390 -128.6768 -137.5897
quadrupole: 20.1181 0.5483 1.9601
quadrupole: -28.5371 18.7250 9.8121 20.1181 0.5483 1.9601
hfenergy: -1829.3531525 hartree
pointgroup: C01 [X(C13H8Cl2N2O4)]
dipole: 2.0604485 -1.966467 -0.0682083 debye
polarizability: 372.4763079|14.3576651|207.0296999|5.8860961|7.1450128|74.2380911 unknown
InChI: InChI=1S/C13H8Cl2N2O4/c14-7-4-5-10(9(15)6-7)16-13(19)8-2-1-3-11(12(8)18)17(20)21/h1-6,16,18H
charge 0 multiplicity 1
29 atoms
Cl 2.968042 -2.834404 0.066907
Cl 7.00359 0.980462 0.024543
O  -2.409388 1.865587 -0.051408
O  0.067463 1.617638 -0.08783
O  -6.090304 0.176382 -0.590312
O  -5.050635 1.779762 0.658358
N  1.115643 -0.465921 -0.029537
N  -5.048672 0.677662 -0.00205
C  -1.344786 -0.344532 -0.092657
C  -2.513724 0.510813 -0.05599
C  2.474053 -0.063203 -0.018414
C  -0.014937 0.324559 -0.071993
C  -3.799602 -0.115732 -0.072377
C  -1.514966 -1.752261 -0.158843
C  -3.936952 -1.512447 -0.161534
C  -2.793072 -2.337204 -0.196847
C  3.477488 -1.071576 0.025482
C  2.906789 1.29141 -0.048163
C  4.849407 -0.781559 0.039223
C  4.279963 1.607591 -0.035764
C  5.234139 0.573922 0.00758
H  0.983038 -1.480902 0.005253
H  -0.649054 -2.423863 -0.19832
H  -4.946011 -1.931731 -0.204652
H  -2.901359 -3.423321 -0.255078
H  2.15229 2.078232 -0.079315
H  5.590783 -1.583089 0.073184
H  4.598467 2.653063 -0.059054
H  -1.390292 2.09396 -0.075688
