program: Gaussian 09
title: 000021904
version: EM64L-G09RevD.01
frameworkgroup: C1[X(C11H22O3)]
method: RPBEPBE
basis: SDD
operation: Freq
keyword: #pfreq=noraman
keyword: PBEPBE/SDD
title: #p freq=noraman PBEPBE/SDD
converged: YES YES NO NO
title: Mulliken charges:
elementType: O O O C C C C C C C C C C C H H H H H H H H H H H H H H H H H H H H H H
charge: -0.331909 -0.273228 -0.440670 0.365127 -0.450558 -0.070349 -0.383198 -0.438567 -0.362459 -0.011453 -0.318559 -0.705501 -0.711636 -0.718421 0.208647 0.225527 0.242151 0.199956 0.213086 0.220731 0.224826 0.192196 0.236412 0.191368 0.186073 0.211200 0.214195 0.244477 0.216219 0.212450 0.207820 0.213690 0.208591 0.213191 0.213273 0.355302
chargesum: 0.00000
title: Mulliken charges with hydrogens summed into heavy atoms:
elementType: O O O C C C C C C C C C C C
charge: -0.331909 -0.273228 -0.085368 0.365127 -0.016384 0.171802 0.029844 0.006990 0.066149 0.179914 0.078714 -0.030610 -0.077675 -0.083366
polarizability: 1.38564040e+02 -4.50884923e+00 1.30611367e+02 5.86060047e+00 -2.68511242e+00 1.12075247e+02
1716.lowfreq: -14.9693 -9.4102 -0.0009 -0.0004 0.0003 10.0856 15.0499 20.4206 53.2932
frequency: -6.0779 12.0582 53.0633 75.9516 92.5162 99.2372 128.6030 148.7472 192.5362 203.0247 212.3706 225.8916 237.2258 269.5594 309.4803 330.4252 366.4224 391.9529 400.1968 405.8807 450.4697 465.0376 491.8372 492.3597 617.4221 650.8129 731.4683 742.6512 772.2760 819.6500 828.9913 852.6077 913.0495 914.4392 929.6189 941.9122 956.3846 961.5828 982.1624 993.8930 1008.8809 1035.1411 1058.9131 1068.1235 1078.6799 1097.7202 1108.8417 1137.6198 1158.6009 1176.3988 1181.3575 1195.6288 1197.7070 1234.1699 1265.3587 1272.2791 1282.0614 1294.4924 1299.7362 1320.7187 1330.7411 1331.5589 1337.9052 1353.3227 1359.6040 1377.3842 1389.7181 1393.9206 1394.9793 1451.8706 1455.6216 1461.8228 1465.7263 1469.0670 1475.4247 1477.7778 1481.3773 1482.2464 1490.0130 1491.6916 2950.5054 2951.2758 2964.8302 2965.5625 2968.4486 2972.0685 2987.1698 2993.4830 3010.5816 3012.5260 3022.7683 3054.1497 3058.1725 3060.5121 3065.7046 3066.4085 3067.3335 3070.7483 3081.8370 3094.7354 3098.0193 3542.5876
redmass: 3.7903 2.9284 3.3609 3.1733 3.2039 2.7484 2.4916 1.9756 2.5814 1.1945 1.3151 1.9155 1.4772 2.3103 2.7118 2.3815 2.8796 2.6505 3.0548 2.2667 2.3500 1.4077 2.4420 3.0552 3.1381 4.0911 4.5643 1.6047 1.3427 2.2079 3.2247 2.2691 1.3206 1.5141 1.4843 1.8196 1.9269 2.4723 4.1035 1.8202 2.4745 4.1558 2.5902 2.1962 2.4903 2.1277 1.9628 2.1435 1.8789 1.7510 1.2784 1.8155 1.2284 1.6386 1.2445 1.2897 1.2924 1.3536 1.2457 1.4578 1.2811 1.3463 1.5100 1.4237 1.4937 1.2164 1.2977 1.2093 1.2130 1.0800 1.0828 1.0746 1.0715 1.0483 1.0703 1.0847 1.0506 1.0524 1.0515 1.0589 1.0676 1.0827 1.0374 1.0686 1.0458 1.0480 1.0365 1.0590 1.0619 1.0838 1.0989 1.1020 1.0996 1.1003 1.0979 1.0975 1.0989 1.0987 1.0994 1.1010 1.0970 1.0655
irintensity: 0.0374 0.0309 0.1772 4.3765 1.5599 0.4034 0.9773 2.6892 3.9600 0.0231 0.6276 0.2326 1.1288 0.8687 2.4674 0.3943 2.0636 5.3641 5.4764 1.4446 41.6414 103.6176 3.8844 22.0498 6.2802 2.7991 4.3568 14.7315 7.1631 8.2809 26.1686 48.5543 8.5661 1.1781 18.5111 1.7154 15.7094 47.2476 102.2933 11.9856 36.6998 92.3323 1.8065 17.7636 3.0094 8.9316 1.9900 7.5843 29.8064 12.3685 10.6917 20.2797 11.8770 9.0029 5.3491 1.2398 22.8097 9.3717 6.8219 16.7120 4.7733 6.0354 18.4509 4.6561 2.6922 23.1914 26.2878 15.7111 25.0408 0.8456 2.9964 14.7659 6.3072 5.0123 8.4219 9.3243 1.1587 17.8665 27.9066 6.8234 35.8376 16.2693 25.4489 68.7252 41.5612 15.1039 28.6131 29.5703 11.2519 51.6807 4.0495 29.3936 35.8365 3.2466 79.2494 25.8772 56.4207 76.9730 49.7838 37.9031 33.6812 7.0079
temp: 298.150 k
press: 1.00000 atm
elementType: 8 8 8 6 6 6 6 6 6 6 6 6 6 6 1 1 1 1 1 1 1 1 1 1 1 1 1 1 1 1 1 1 1 1 1 1
symmnumber: 1
zpe: 829415.2 jmol-1
zpe.correction: 0.315908 hartree
zpe.thermalcorrener: 0.331949 hartree
zpe.thermalcorrenthalpy: 0.332894 hartree
zpe.thermalcorrgfe: 0.271692 hartree
zpe.sumelectzpe: -656.851595 hartree
zpe.sumelectthermal: -656.835554 hartree
zpe.sumelectthermalent: -656.834609 hartree
zpe.sumelectthermalfe: -656.895811 hartree
dipole: -1.0258 0.8999 1.4543
dipole: 1.9942
quadrupole: -86.0101 -96.1171 -88.3555
quadrupole: 2.9166 5.6716 -7.1147
quadrupole: 4.1508 -5.9562 1.8054 2.9166 5.6716 -7.1147
hfenergy: -657.167503 hartree
pointgroup: C01 [X(C11H22O3)]
dipole: 0.4465534 -0.3844352 0.5180466 debye
polarizability: 138.6733235|-3.0706909|129.3130389|-7.3484347|4.2512367|113.264291 unknown
InChI: InChI=1S/C11H22O3/c1-4-11(6-5-9(2)3)13-8-10(7-12)14-11/h9-10,12H,4-8H2,1-3H3
charge 0 multiplicity 1
36 atoms
O  -1.213924 0.121707 -0.720032
O  -1.405981 -1.595656 0.894943
O  -2.545159 2.647949 -0.914497
C  -0.480532 -1.042196 -0.124035
C  0.80652 -0.529382 0.555464
C  -2.430829 0.398551 0.098643
C  1.828184 0.101689 -0.416312
C  -0.299863 -2.104058 -1.217157
C  -2.239122 -0.472288 1.359702
C  3.077967 0.69878 0.28651
C  -2.481465 1.90976 0.347424
C  0.428431 -3.377015 -0.736686
C  2.729663 1.936268 1.149448
C  4.159071 1.060357 -0.759719
H  0.507795 0.211397 1.320928
H  1.273421 -1.376793 1.093723
H  -3.310599 0.080923 -0.492975
H  2.167945 -0.66857 -1.137991
H  1.328404 0.894932 -1.007941
H  0.241476 -1.640854 -2.062393
H  -1.310965 -2.35882 -1.582686
H  -1.730165 0.093396 2.16797
H  -3.176519 -0.904781 1.741201
H  3.4973 -0.082463 0.957515
H  -1.592814 2.211002 0.944092
H  -3.398239 2.188178 0.89623
H  1.474107 -3.16735 -0.446508
H  -0.089496 -3.816726 0.133517
H  0.45042 -4.133134 -1.541747
H  2.015689 1.694325 1.957762
H  2.279052 2.730754 0.52307
H  3.637856 2.353692 1.622506
H  3.781991 1.828723 -1.46244
H  5.067405 1.464504 -0.27517
H  4.455635 0.175952 -1.354537
H  -1.809163 2.308349 -1.487624
