program: Gaussian 09
title: 000231258
version: EM64L-G09RevD.01
frameworkgroup: C1[X(C9H11Cl2N3)]
method: RPBEPBE
basis: SDD
operation: Freq
keyword: #p
keyword: freq=noraman
keyword: PBEPBE/SDD
title: #p freq=noraman PBEPBE/SDD
converged: NO YES NO NO
title: Mulliken charges:
elementType: Cl Cl N N N C C C C C C C C C H H H H H H H H H H H
charge: -0.024421 -0.024288 -0.105061 -0.008029 -0.008102 -0.403655 -0.376220 -0.376328 -0.396222 -0.396473 0.080658 -0.169351 -0.169176 -0.140916 0.192493 0.225356 0.212588 0.207661 0.207593 0.212433 0.277140 0.210707 0.210882 0.277197 0.283535
chargesum: 0.00000
title: Mulliken charges with hydrogens summed into heavy atoms:
elementType: Cl Cl N N N C C C C C C C C C
charge: -0.024421 -0.024288 -0.105061 -0.008029 -0.008102 0.014194 0.044028 0.043697 0.091625 0.091607 0.080658 -0.169351 -0.169176 0.142619
polarizability: 1.97358160e+02 2.13589827e-02 1.57430496e+02 -8.95739045e+00 -4.44589760e-02 7.57717974e+01
1716.lowfreq: -7.7673 -0.0023 -0.0018 0.0030 7.3469 14.5397 44.9047 62.3656 111.4885
frequency: 44.7925 61.7055 111.4632 126.4187 149.1650 174.1436 202.9985 215.4318 258.3556 318.6347 329.6312 386.5779 392.1091 403.6361 440.2645 493.1052 550.2031 571.5700 588.5663 630.7787 754.7733 757.4782 765.2396 796.3747 804.7927 833.1602 847.5670 903.9312 911.4794 948.6692 972.2579 1024.2620 1057.3482 1063.9850 1094.6667 1125.7889 1149.2079 1155.9470 1211.6304 1222.2355 1254.2408 1261.0861 1276.4114 1283.8952 1327.5141 1339.4668 1346.0977 1347.1470 1362.9842 1367.2550 1449.7849 1457.7732 1463.1895 1465.7290 1472.1499 1476.9995 1542.5147 1577.9667 2962.7052 2966.1368 2969.6209 2989.7515 2990.2202 3039.3912 3050.4640 3058.3101 3102.0921 3103.6524 3227.7358
redmass: 4.0729 3.8140 4.7930 8.2495 5.5753 11.5928 5.3273 3.5669 2.3877 5.1140 3.6768 6.6398 2.0165 8.1313 2.9586 2.3627 5.6669 12.3364 2.5070 4.6366 6.2535 6.5959 12.1789 1.4440 1.4949 2.9880 1.4526 2.4915 6.4161 1.3115 3.2116 2.5468 2.1240 1.8286 1.4094 2.3093 2.4263 1.2549 7.1054 2.3471 1.2691 3.5806 1.2922 1.4500 1.2693 1.3778 1.4660 1.4402 1.3888 4.5023 6.1948 1.1138 1.0906 1.0939 1.0758 1.1073 6.8245 8.7877 1.0698 1.0698 1.0646 1.0621 1.0603 1.0961 1.1024 1.1032 1.0928 1.0941 1.0961
irintensity: 0.2823 0.0108 0.2932 0.8264 5.9715 1.4609 0.5629 1.2716 1.8545 8.2401 3.2486 5.1078 2.7160 9.8714 0.7800 2.5137 2.7840 0.0110 1.9978 7.8814 7.5942 3.5646 119.9043 37.8008 1.3160 1.2648 21.9587 2.2320 0.6238 6.2293 135.8293 4.4664 60.4699 50.8656 7.9954 0.8634 13.2048 0.2525 132.0442 5.2607 9.9590 0.0150 10.7893 127.6479 0.5568 0.6323 5.2378 0.6117 5.5145 24.0304 431.7377 0.1250 24.7148 37.0741 7.2604 13.9679 2.1195 1344.5656 14.3228 62.1306 63.6071 21.3527 35.9360 58.6011 28.8941 89.2223 3.7369 3.4818 6.3780
temp: 298.150 k
press: 1.00000 atm
elementType: 17 17 7 7 7 6 6 6 6 6 6 6 6 6 1 1 1 1 1 1 1 1 1 1 1
symmnumber: 1
zpe: 504720.2 jmol-1
zpe.correction: 0.192238 hartree
zpe.thermalcorrener: 0.204960 hartree
zpe.thermalcorrenthalpy: 0.205904 hartree
zpe.thermalcorrgfe: 0.151911 hartree
zpe.sumelectzpe: -1432.892889 hartree
zpe.sumelectthermal: -1432.880167 hartree
zpe.sumelectthermalent: -1432.879222 hartree
zpe.sumelectthermalfe: -1432.933215 hartree
dipole: -3.8359 -0.0071 0.1456
dipole: 3.8386
quadrupole: -85.4485 -104.6727 -95.8945
quadrupole: 0.0542 -1.3063 0.0289
quadrupole: 9.8901 -9.3341 -0.5559 0.0542 -1.3063 0.0289
hfenergy: -1433.0851265 hartree
pointgroup: C01 [X(C9H11Cl2N3)]
dipole: 1.504989 0.0142093 -0.1249719 debye
dipolederiv: -0.3897823 0.3354689 0.07718 0.4587064 -0.7753106 -0.1344449 0.0999936 -0.1278255 -0.1129914 -0.388085 -0.3432427 0.0163899 -0.468079 -0.8021775 0.0106166 0.0164677 0.004075 -0.087852 -1.7514028 -0.0152879 0.1416035 -0.0140378 -0.3952219 -0.0038957 0.1270822 -0.002961 -0.3515589 -1.7037163 0.2094843 0.2439041 0.5936437 -0.5495707 -0.1090516 0.3469859 -0.0745717 -0.22565 -1.701075 -0.2531225 0.2012138 -0.6488579 -0.5744713 0.0480016 0.2388823 0.0126831 -0.2044398 0.0932225 0.0027576 -0.0307573 0.0072045 0.0319564 -0.0091277 -0.0882714 -0.0093538 0.1411655 0.0765573 -0.0023464 -0.0386273 -0.0642893 0.0563179 0.0062528 0.0206403 0.0075622 0.0822573 0.0761509 0.009088 -0.0373075 0.0614976 0.0593175 -0.0101885 0.0322602 -0.0122988 0.0806405 0.2866189 0.2303022 -0.0320979 0.5516083 0.2727834 -0.0773713 -0.0160774 -0.0548288 0.2833719 0.2911959 -0.2222505 -0.0691175 -0.5423725 0.2476735 0.0714389 -0.1088446 0.0502304 0.3052441 2.6118092 0.0345692 -0.3390192 0.0445668 0.3903703 0.0156589 -0.4610622 0.0149821 0.2240336 1.5917583 -0.2213511 -0.2707478 -0.4693511 1.5104886 0.2059281 -0.3404129 0.1765946 0.1181311 1.5905043 0.2665582 -0.2256657 0.5219371 1.5357259 0.0478238 -0.2502252 0.0772823 0.0944731 -0.5918948 -0.0048181 0.0597834 -0.0071555 -1.1691521 -0.0909428 0.0889031 -0.090452 -0.1536374 0.0318502 -0.0062453 0.0768154 -0.0137717 0.0167444 0.0132333 0.1698638 0.0136765 -0.1392515 -0.1337308 0.009268 -0.1218211 0.013345 0.0519984 0.0062192 -0.1732261 0.0059634 -0.0297373 0.0238614 0.0377823 0.0828954 0.0361184 0.0682841 0.0335509 0.0489603 -0.0112402 -0.1331557 -0.0740677 -0.1170258 -0.002095 -0.121997 -0.1386123 0.0030447 -0.0131534 0.0256625 0.0852817 -0.0764125 0.1165025 0.0170601 0.1228437 -0.1260387 -0.0378611 0.0071202 -0.0605664 0.0747324 0.0244778 -0.0513142 0.0754987 -0.0439419 0.0656608 -0.0001053 0.0415165 0.0447487 -0.1320174 0.0999006 0.0907167 -0.0146195 0.0368295 0.0038544 -0.0063065 -0.0187868 -0.0221608 0.0925854 -0.0634739 -0.0792772 0.0876771 -0.1116194 0.0519229 -0.017192 0.1027557 0.0530871 -0.1521096 -0.063777 0.0634653 0.0976805 0.0928176 0.0533466 0.050191 0.1188186 -0.0201176 -0.1533209 0.1007424 -0.0867548 -0.0275657 -0.0326619 0.0007707 -0.0078701 -0.0230479 0.0076027 0.0944101 0.0387683 -0.0029266 0.0317396 -0.0029837 0.1133394 -0.0076021 0.0328573 -0.0077742 0.1993953 unknown
polarizability: 196.2948223|1.4013415|156.8120033|-14.3663875|7.0357778|77.4536274 unknown
InChI: InChI=1S/C9H11Cl2N3/c10-7-6-8(11)13-9(12-7)14-4-2-1-3-5-14/h6H,1-5H2
charge 0 multiplicity 1
25 atoms
Cl -2.996897 2.736481 0.550844
Cl -2.990814 -2.802328 0.057976
N  1.160366 0.043479 -0.504096
N  -0.828672 1.220841 -0.005022
N  -0.825495 -1.207941 -0.219049
C  3.972198 -0.005057 0.261489
C  3.094573 1.249219 0.487764
C  3.107581 -1.287683 0.282679
C  1.934624 1.305791 -0.532022
C  1.943651 -1.193171 -0.731632
C  -0.181313 0.018282 -0.237616
C  -2.136476 1.156995 0.240069
C  -2.133574 -1.19127 0.03272
C  -2.902853 -0.03074 0.280016
H  4.482834 0.077174 -0.720708
H  4.765541 -0.064193 1.029792
H  2.674352 1.233981 1.5122
H  3.698976 2.171221 0.393838
H  3.720314 -2.176436 0.03983
H  2.690232 -1.442683 1.296574
H  1.244991 2.136354 -0.321625
H  2.343782 1.439193 -1.555422
H  2.349683 -1.161803 -1.764681
H  1.259821 -2.05123 -0.653765
H  -3.971826 -0.049676 0.481646
