program: Gaussian 09
title: 000231244
version: EM64L-G09RevD.01
frameworkgroup: C1[X(C15H13NO)]
method: RPBEPBE
basis: SDD
operation: Freq
keyword: #p
keyword: freq=noraman
keyword: PBEPBE/SDD
title: #p freq=noraman PBEPBE/SDD
converged: YES YES NO NO
title: Mulliken charges:
elementType: O N C C C C C C C C C C C C C C C H H H H H H H H H H H H H
charge: -0.262276 -0.501344 0.309373 0.204801 0.302917 -0.525496 0.359732 -0.368186 -0.424465 -0.368290 -0.395620 -0.220680 -0.251387 -0.366072 -0.372231 0.320472 -0.537010 0.307507 0.252762 0.228853 0.236923 0.239121 0.211342 0.219804 0.219388 0.250845 0.239738 0.221058 0.221553 0.246868
chargesum: 0.00000
title: Mulliken charges with hydrogens summed into heavy atoms:
elementType: O N C C C C C C C C C C C C C C C
charge: -0.262276 -0.193838 0.309373 0.204801 0.302917 -0.272734 0.359732 -0.139333 -0.187542 -0.129168 -0.184278 -0.000876 -0.032000 -0.115227 -0.132493 0.320472 0.152470
polarizability: 3.59094174e+02 -3.50369325e+00 1.61937609e+02 -9.54594625e-01 9.28270574e-01 7.55127690e+01
1716.lowfreq: -5.2338 -1.5058 -0.0006 0.0002 0.0007 5.5191 37.2307 43.8992 73.9543
frequency: 37.1296 43.8752 73.9492 97.1795 147.5612 206.1749 222.9550 245.4666 249.4852 268.7823 330.3503 373.3266 412.4798 438.7327 453.8975 494.7336 513.1413 528.7807 542.2114 573.0064 602.8119 612.1371 632.1526 658.7956 728.8616 742.2847 753.4463 761.4520 795.2074 802.2612 811.8670 838.3503 852.4463 884.1173 922.8175 928.4451 930.4821 966.8016 968.8590 986.7572 999.1334 1010.6233 1050.8026 1111.1795 1113.7671 1114.2417 1155.8140 1163.8114 1181.9737 1190.9118 1231.5584 1234.8233 1251.8432 1302.2084 1314.9651 1320.6932 1358.8701 1385.4237 1417.3054 1431.5652 1434.9073 1461.6292 1466.2371 1471.9708 1481.0322 1492.9047 1559.1934 1576.1164 1592.0919 1625.1139 1631.0323 2959.8657 3047.7681 3121.8434 3122.8869 3125.9467 3131.0641 3144.8768 3144.9943 3162.3695 3163.6245 3171.5186 3215.6982 3609.1716
redmass: 3.5957 4.6900 4.6709 3.8319 4.5720 2.7261 1.5704 3.6177 4.7033 3.5731 4.4486 4.8061 2.9196 3.1854 4.3346 3.4275 1.4447 2.2163 4.3739 3.5300 6.5549 5.9079 6.1667 3.4781 2.7009 1.3705 3.3607 5.5468 3.7944 1.4956 1.4110 1.6204 1.5551 5.1469 5.8968 1.3888 1.4314 1.3639 1.3050 8.4335 2.8153 2.1437 2.1718 1.2606 1.5533 1.4141 1.3416 1.0933 1.2850 1.5125 2.0741 2.9713 1.6041 1.4737 2.8768 2.4506 2.4205 6.5346 3.0666 3.5698 1.1796 4.9667 1.0512 1.1153 2.4103 2.8791 5.9150 7.0520 5.6430 6.5598 6.9229 1.0329 1.1039 1.0886 1.0849 1.0991 1.0890 1.0884 1.0951 1.1002 1.0937 1.0965 1.0973 1.0799
irintensity: 0.2703 0.3265 0.0858 2.8389 6.4328 2.6194 0.4695 1.1721 1.1682 1.0436 3.3166 0.3769 0.1652 6.6698 1.6479 0.2226 41.4012 58.2984 35.2016 0.5584 1.6174 5.1425 3.1299 2.9627 0.6558 52.7939 27.7453 9.3512 6.9078 91.2065 6.8175 54.4995 4.5330 0.2152 1.4637 5.5846 0.0905 0.1569 0.0669 56.5055 6.4516 12.6113 12.6187 0.2073 13.6469 6.0291 1.9382 0.6708 87.0379 25.1408 7.9554 223.4954 15.0036 1.2402 4.3272 20.3699 37.6802 41.7895 46.3299 14.0887 16.4019 17.0569 15.2414 90.1441 47.5026 96.9471 18.0630 23.8011 0.5917 37.0698 6.8408 86.6767 49.4592 28.9060 1.9049 18.6564 2.7785 7.1209 38.6360 46.7716 15.6995 6.1951 5.1744 32.2077
temp: 298.150 k
press: 1.00000 atm
elementType: 8 7 6 6 6 6 6 6 6 6 6 6 6 6 6 6 6 1 1 1 1 1 1 1 1 1 1 1 1 1
symmnumber: 1
zpe: 626178.9 jmol-1
zpe.correction: 0.238499 hartree
zpe.thermalcorrener: 0.252361 hartree
zpe.thermalcorrenthalpy: 0.253305 hartree
zpe.thermalcorrgfe: 0.197165 hartree
zpe.sumelectzpe: -708.195758 hartree
zpe.sumelectthermal: -708.181896 hartree
zpe.sumelectthermalent: -708.180952 hartree
zpe.sumelectthermalfe: -708.237093 hartree
dipole: 2.5426 -2.7373 -0.0219
dipole: 3.7361
quadrupole: -87.1412 -84.7061 -106.5891
quadrupole: -8.1686 1.9698 0.7643
quadrupole: 5.6710 8.1060 -13.7769 -8.1686 1.9698 0.7643
hfenergy: -708.4342571 hartree
pointgroup: C01 [X(C15H13N1O1)]
dipole: -0.9863363 1.0897994 0.0058949 debye
polarizability: 358.9732442|-6.0576141|162.071048|-0.3013937|-0.0891943|75.50026 unknown
InChI: InChI=1S/C15H13NO/c1-17-13-8-6-11(7-9-13)15-10-12-4-2-3-5-14(12)16-15/h2-10,16H,1H3
charge 0 multiplicity 1
30 atoms
O  -5.253692 -0.245021 -0.06021
N  1.233442 1.009629 -0.140477
C  0.468261 -0.166617 0.017129
C  2.597051 0.70064 -0.093026
C  2.701751 -0.722549 0.120484
C  1.355812 -1.240523 0.184206
C  -0.999843 -0.142596 0.008025
C  3.730223 1.532866 -0.218272
C  3.99318 -1.306888 0.223512
C  -1.740027 -1.332861 -0.258298
C  -1.735275 1.046075 0.261885
C  4.998364 0.923048 -0.11838
C  5.127359 -0.480922 0.102268
C  -3.141938 -1.334097 -0.267906
C  -3.147104 1.063971 0.246668
C  -3.856151 -0.132904 -0.019134
C  -6.03869 0.966939 0.185559
H  0.848717 1.923416 -0.368416
H  1.069454 -2.273733 0.372966
H  3.637035 2.612245 -0.383359
H  4.104514 -2.383783 0.392108
H  -1.20245 -2.261139 -0.478182
H  -1.209381 1.974692 0.515579
H  5.900584 1.538159 -0.209644
H  6.129076 -0.918604 0.177658
H  -3.708697 -2.246571 -0.475532
H  -3.673716 2.00009 0.45395
H  -5.822095 1.747152 -0.570008
H  -5.850952 1.369796 1.199942
H  -7.088812 0.651292 0.101305
