program: Gaussian 09
title: 000231220
version: EM64L-G09RevD.01
frameworkgroup: C1[X(C8H12N2O3)]
method: RPBEPBE
basis: SDD
operation: Freq
keyword: #p
keyword: freq=noraman
keyword: PBEPBE/SDD
title: #p freq=noraman PBEPBE/SDD
converged: YES YES NO NO
title: Mulliken charges:
elementType: O O O N N C C C C C C C C H H H H H H H H H H H H
charge: -0.191152 -0.232231 -0.143159 -0.453122 -0.184583 0.193700 -0.379660 0.146113 -0.369721 0.191417 -0.107797 -0.693688 -0.599919 0.247027 0.211247 0.334661 0.180437 0.231807 0.191399 0.212311 0.223648 0.222345 0.252173 0.251871 0.264876
chargesum: 0.00000
title: Mulliken charges with hydrogens summed into heavy atoms:
elementType: O O O N N C C C C C C C C
charge: -0.191152 -0.232231 -0.143159 -0.118462 -0.184583 0.193700 0.078613 0.146113 0.042523 0.191417 0.083602 -0.035383 0.169001
polarizability: 1.32318737e+02 1.13302856e+01 1.02689044e+02 3.85712844e+00 -6.89292629e+00 8.68741315e+01
1716.lowfreq: -15.3547 -11.0758 -7.8804 0.0008 0.0011 0.0011 47.7397 67.3989 72.1071
frequency: 47.6207 67.3043 72.0762 80.0963 86.8888 100.3884 143.9386 198.0184 230.3812 242.6469 258.2224 264.0441 279.5153 305.4533 368.2232 408.6786 467.1071 487.1446 584.5450 635.9690 680.3785 681.8095 718.0326 726.9302 756.4080 841.0216 873.1572 906.2459 919.5534 985.3158 1010.8926 1045.5587 1071.7316 1121.2782 1131.2680 1150.8198 1162.3081 1202.8226 1248.5782 1253.3830 1286.8346 1296.5574 1341.3194 1350.7949 1363.5663 1373.2045 1393.6004 1438.7836 1450.4269 1470.7301 1471.9309 1478.5847 1484.4728 1484.7135 1630.4874 1666.3390 1720.6108 2888.2389 2967.3133 2979.3892 2999.0660 3003.8330 3032.1971 3067.0795 3079.5015 3082.3016 3096.6266 3122.2697 3609.2443
redmass: 3.2073 1.9483 2.1020 1.7188 3.3508 4.0555 7.3927 3.2174 1.5689 1.8649 3.0444 3.0256 5.1517 3.0431 7.3014 6.7682 4.3912 1.1157 10.6831 3.5073 6.8634 6.6404 5.5586 1.8519 2.0791 2.4738 1.5918 2.5895 1.9857 1.9910 2.5450 2.7678 3.0576 2.5635 1.3100 3.8052 2.6367 3.7895 1.8770 1.8044 1.3770 1.1102 1.7707 1.4480 3.2389 1.3903 1.2055 1.2812 1.0801 1.0422 1.0655 1.0414 1.0687 1.0656 10.2236 10.3665 9.8124 1.0871 1.0631 1.0360 1.0625 1.0329 1.0944 1.1014 1.1012 1.0999 1.1024 1.1021 1.0801
irintensity: 0.1042 0.0866 2.5305 2.1148 0.7341 1.4725 7.6789 1.2262 4.7655 6.8799 5.7579 0.3197 6.8367 3.2159 13.4578 4.8881 25.2699 125.9716 11.6118 7.2544 14.0256 18.2988 7.5803 11.8259 22.6333 11.0318 6.5455 13.4932 27.9501 48.8575 42.4122 10.6988 32.5308 3.9197 0.0351 4.1999 9.5392 38.4852 16.8440 41.3673 3.3798 4.9954 45.4566 5.5647 143.3339 17.5304 10.1121 97.7351 6.0418 19.5793 3.3768 14.5328 12.3879 14.6753 134.9218 642.8932 202.5354 83.1796 36.4408 29.8601 13.5013 26.7055 4.7144 0.0843 59.4723 40.4731 16.4953 0.5405 50.8069
temp: 298.150 k
press: 1.00000 atm
elementType: 8 8 8 7 7 6 6 6 6 6 6 6 6 1 1 1 1 1 1 1 1 1 1 1 1
symmnumber: 1
zpe: 517060.5 jmol-1
zpe.correction: 0.196938 hartree
zpe.thermalcorrener: 0.211079 hartree
zpe.thermalcorrenthalpy: 0.212023 hartree
zpe.thermalcorrgfe: 0.155327 hartree
zpe.sumelectzpe: -646.250573 hartree
zpe.sumelectthermal: -646.236432 hartree
zpe.sumelectthermalent: -646.235488 hartree
zpe.sumelectthermalfe: -646.292184 hartree
dipole: 0.3583 -2.0160 -0.1193
dipole: 2.0511
quadrupole: -75.6232 -91.1749 -76.6264
quadrupole: -12.6565 1.1297 2.1616
quadrupole: 5.5183 -10.0334 4.5151 -12.6565 1.1297 2.1616
hfenergy: -646.4475107 hartree
pointgroup: C01 [X(C8H12N2O3)]
dipole: 0.121798 0.7969037 0.0358748 debye
dipolederiv: -0.5062728 0.0067274 0.0288562 0.0584163 -0.8541181 0.3727673 -0.0251824 0.3408301 -0.5373569 -0.9276362 0.3768449 -0.0733714 0.4760588 -0.8999698 0.2049357 -0.1194252 0.2266771 -0.4382053 -0.7616966 0.270669 0.1523139 0.333328 -0.5054536 -0.2582698 0.0688813 -0.143435 -0.4056051 -1.1472012 0.0713403 0.0582099 0.0869624 -0.4321976 -0.0704288 0.1063801 -0.0759691 -0.5463197 -0.9107615 0.3278437 -0.007617 0.2060617 -1.0623284 0.4798534 0.0662611 0.4562374 -0.4715171 -0.2548207 -0.0977275 0.3341641 -0.2347973 0.176215 -0.0582493 0.5501582 -0.1113388 -0.1921586 0.0870277 0.03813 -0.0106857 0.0311391 0.0252371 0.0269287 0.0391844 0.082686 0.0680053 1.2069426 -0.4730549 -0.0654652 -0.1801139 1.0341619 -0.6626701 -0.13785 -0.5115609 0.543778 0.0588425 -0.0470717 -0.0330538 -0.0160839 0.164239 -0.0029427 -0.1086278 -0.0322476 0.0285248 1.6375992 -0.3536497 -0.1362964 -0.4344128 1.4604157 -0.5935015 -0.1347665 -0.6173454 0.6341663 0.7957438 -0.3562794 -0.0456874 -0.5832575 0.4539997 0.520111 -0.2143924 0.3998493 0.7858547 -0.0195317 -0.038244 -0.0547085 -0.0544509 0.0594788 -0.0034322 -0.0007205 0.0132842 0.063636 0.3978734 0.1199738 -0.118638 0.1071993 0.1241054 0.0280625 -0.1195335 0.0330651 0.2397269 0.0177567 0.0300746 -0.0261205 0.0205786 -0.0306675 0.053842 -0.0163317 0.039046 0.0836335 0.0145277 0.0028875 0.0566545 0.0100285 0.0282822 -0.089996 0.0585138 -0.0669193 -0.0677694 0.1994215 0.0269412 0.0584342 0.0471986 0.2000725 0.0548805 0.0556411 0.0479528 0.3300311 -0.0050226 0.1022301 -0.0602937 0.0694412 -0.1241429 0.0920499 -0.0381989 0.0813559 0.0254447 0.0463062 0.0067262 0.0382641 0.0407774 0.0386821 -0.087666 0.0465224 -0.0602652 -0.0938992 -0.0446373 0.0134524 -0.1765582 0.0504539 0.0749715 0.0046533 -0.1147477 -0.0632294 -0.1272273 0.0446884 0.0601283 0.0918366 0.0326047 0.0396174 -0.0975328 0.0178506 -0.1025865 -0.0973442 0.0557775 0.0512781 -0.0360858 0.1089619 -0.1026608 0.0728461 -0.0519804 0.0389234 0.0561052 -0.1084235 -0.1210544 0.0350104 -0.141775 0.0141676 0.0405798 0.0649694 0.056762 0.0449091 0.041359 -0.0205567 -0.037499 -0.0325094 0.1050445 0.0090201 0.0569664 -0.006221 -0.103984 0.0276475 -0.0249848 0.0244766 -0.1142822 -0.0465747 -0.0573692 0.0014805 -0.0663808 0.0613998 0.0544907 0.0273757 0.00386 0.1124726 0.059423 0.0215282 -0.0510522 0.0408297 0.1161716 unknown
polarizability: 132.8965534|-10.6076189|101.9530106|-3.1377928|-7.3026898|87.0323487 unknown
InChI: InChI=1S/C8H12N2O3/c1-3-4-8(5-11)6(12)10(2)7(13)9-8/h5,9H,3-4H2,1-2H3
charge 0 multiplicity 1
25 atoms
O  -0.690637 -1.908708 1.182316
O  -2.418128 2.023399 -0.74926
O  1.840228 -1.782502 -1.464696
N  -0.243917 1.048091 -0.768803
N  -1.884872 -0.057181 0.309561
C  0.428781 -0.150954 -0.241611
C  1.612815 0.118605 0.719092
C  -0.754284 -0.850154 0.515857
C  2.748679 0.96831 0.105211
C  -1.595339 1.126925 -0.453951
C  0.816863 -1.072156 -1.430043
C  3.894841 1.187426 1.116655
C  -3.211596 -0.335858 0.866116
H  2.007196 -0.867573 1.025763
H  1.224784 0.616494 1.628527
H  0.228549 1.79829 -1.2688
H  2.355621 1.956412 -0.212342
H  3.1473 0.465507 -0.795891
H  0.078849 -1.037646 -2.271517
H  3.53385 1.70817 2.023261
H  4.328986 0.22098 1.432274
H  4.705936 1.794939 0.676915
H  -3.172992 -0.355946 1.968483
H  -3.578851 -1.31234 0.508707
H  -3.888362 0.466368 0.53138
