program: Gaussian 09
title: 000231212
version: EM64L-G09RevD.01
frameworkgroup: C1[X(C8H14N2O4)]
method: RPBEPBE
basis: SDD
operation: Freq
keyword: #p
keyword: freq=noraman
keyword: PBEPBE/SDD
title: #p freq=noraman PBEPBE/SDD
converged: YES YES NO NO
title: Mulliken charges:
elementType: O O O O N N C C C C C C C C H H H H H H H H H H H H H H
charge: -0.276561 -0.232345 -0.200789 -0.246728 -0.427748 -0.188437 0.195868 0.012908 0.138426 -0.704832 0.179582 -0.605253 -0.530007 -0.504789 0.203961 0.339416 0.240199 0.270794 0.222610 0.244374 0.249703 0.262553 0.216036 0.222593 0.243300 0.230541 0.244147 0.200479
chargesum: 0.00000
title: Mulliken charges with hydrogens summed into heavy atoms:
elementType: O O O O N N C C C C C C C C
charge: -0.276561 -0.232345 -0.200789 -0.246728 -0.088332 -0.188437 0.195868 0.216868 0.138426 0.028771 0.179582 0.151377 0.151922 0.170378
polarizability: 1.29131537e+02 7.09802289e+00 1.19621113e+02 -6.94719890e+00 6.47987928e-01 8.75137096e+01
1716.lowfreq: -15.1774 -10.5884 -2.1430 -0.0007 -0.0002 0.0002 35.7660 47.1434 72.5737
frequency: 35.7280 46.8213 72.5480 78.0837 101.3646 113.1624 138.0174 159.4856 181.3346 197.0796 211.9007 214.5359 252.2578 261.3922 278.7554 303.3194 334.0539 347.1236 370.1633 455.3522 507.4267 527.3804 584.0411 650.4486 676.6616 693.9296 715.9013 739.2605 860.4432 884.8489 925.7979 942.5900 974.7587 1000.9790 1026.9237 1063.6552 1106.7556 1111.5353 1131.3187 1132.4853 1139.9763 1162.7823 1173.9133 1188.3498 1222.4690 1265.2473 1313.6662 1338.3298 1358.8532 1365.7480 1383.7007 1429.4401 1435.2920 1438.2464 1457.7545 1461.0305 1464.1476 1471.4872 1472.5872 1474.3191 1481.9001 1486.3505 1652.3931 1714.8354 2901.7168 2947.4194 2952.1483 2999.5457 3003.9196 3035.7026 3046.3897 3089.3498 3104.0355 3109.9585 3118.5073 3123.6439 3127.7457 3616.5463
redmass: 3.3111 4.1473 2.8811 3.2475 1.2354 2.1842 1.4233 3.6090 2.8925 1.3845 2.3836 1.0711 3.5748 3.3401 5.3305 3.9881 3.8513 4.7730 6.8700 4.3788 2.8870 1.3960 10.3973 3.7918 7.0640 7.4297 7.2750 4.2723 5.1610 4.0696 5.5439 2.1488 1.8427 7.1477 2.4448 3.8134 1.2493 1.2861 1.3109 2.5868 1.3458 2.6632 2.6019 2.9852 2.8904 3.8993 1.4143 1.2887 1.6209 3.4784 1.2735 1.1457 1.1355 1.3108 1.0531 1.0581 1.0529 1.0538 1.0448 1.0592 1.0526 1.0664 11.2584 9.9795 1.0835 1.0355 1.0339 1.0330 1.0349 1.1038 1.0988 1.1021 1.1016 1.0992 1.1017 1.0999 1.1000 1.0799
irintensity: 1.7787 1.4654 5.0801 4.3487 0.7175 1.7431 0.9741 8.9567 4.5848 1.7135 7.5400 0.9269 2.9824 5.8967 2.8323 3.0982 3.7361 1.4219 27.7949 8.8249 72.3091 91.0567 9.3400 3.6788 11.1595 12.8873 13.5862 8.0203 35.7910 7.2696 14.0978 59.4752 10.6559 153.1199 82.3194 137.4484 0.2066 3.8199 0.0723 32.9404 10.0462 27.4925 8.0927 5.4346 14.4554 110.9418 42.2729 26.1356 9.5667 117.7362 24.5590 3.0159 9.7290 88.5602 5.6874 17.5972 8.5796 15.1853 19.4872 12.9779 12.5087 13.6427 572.5704 234.3154 45.3198 22.5638 102.8435 33.1033 13.6165 49.8874 50.9912 19.4690 18.1182 23.4745 0.8713 18.9907 4.5448 54.8361
temp: 298.150 k
press: 1.00000 atm
elementType: 8 8 8 8 7 7 6 6 6 6 6 6 6 6 1 1 1 1 1 1 1 1 1 1 1 1 1 1
symmnumber: 1
zpe: 585805.7 jmol-1
zpe.correction: 0.223122 hartree
zpe.thermalcorrener: 0.239190 hartree
zpe.thermalcorrenthalpy: 0.240134 hartree
zpe.thermalcorrgfe: 0.179305 hartree
zpe.sumelectzpe: -722.548990 hartree
zpe.sumelectthermal: -722.532922 hartree
zpe.sumelectthermalent: -722.531978 hartree
zpe.sumelectthermalfe: -722.592807 hartree
dipole: -3.2044 1.4251 -1.6896
dipole: 3.8928
quadrupole: -78.3833 -93.0727 -77.9439
quadrupole: -10.0630 5.4090 0.3588
quadrupole: 4.7500 -9.9394 5.1894 -10.0630 5.4090 0.3588
hfenergy: -722.772112 hartree
pointgroup: C01 [X(C8H14N2O4)]
dipole: -1.1432552 -0.6571402 0.7789397 debye
polarizability: 131.3166275|-5.4836878|118.2358212|4.3436067|-0.0189279|86.7139105 unknown
InChI: InChI=1S/C8H14N2O4/c1-8(6(13-3)14-4)5(11)10(2)7(12)9-8/h6,9H,1-4H3
charge 0 multiplicity 1
28 atoms
O  -1.913549 -1.473401 -0.16715
O  -2.215853 0.900307 0.005368
O  0.623969 2.381377 -0.116553
O  3.007994 -1.676804 -0.036111
N  0.780659 -1.141214 -0.693726
N  2.074484 0.526218 0.080187
C  -0.092821 0.044354 -0.766555
C  -1.3016 -0.181153 0.19635
C  0.861837 1.155844 -0.232428
C  -0.569817 0.364824 -2.198503
C  2.050498 -0.883274 -0.207465
C  3.260854 1.210784 0.595285
C  -2.076764 -2.408994 0.956456
C  -3.357521 0.88591 0.928695
H  -0.955601 -0.237188 1.257431
H  0.47752 -2.065552 -0.992504
H  -1.261236 -0.419688 -2.54997
H  -1.10013 1.329395 -2.196241
H  0.294964 0.422287 -2.881685
H  3.057576 1.651277 1.58648
H  3.56522 2.019714 -0.090358
H  4.066936 0.464185 0.677921
H  -2.735254 -1.994061 1.745056
H  -1.100025 -2.681748 1.403717
H  -2.546732 -3.308374 0.528507
H  -4.022259 0.027821 0.716996
H  -3.895854 1.828549 0.751573
H  -3.014495 0.847303 1.984024
