program: Gaussian 09
title: 000231202
version: EM64L-G09RevD.01
frameworkgroup: C1[X(C18H20N2O2)]
method: RPBEPBE
basis: SDD
operation: Freq
keyword: #p
keyword: freq=noraman
keyword: PBEPBE/SDD
title: #p freq=noraman PBEPBE/SDD
converged: YES YES NO NO
title: Mulliken charges:
elementType: O O N N C C C C C C C C C C C C C C C C C C H H H H H H H H H H H H H H H H H H H H
charge: -0.268314 -0.268309 -0.227966 -0.227959 -0.537275 -0.537283 0.201779 0.201767 0.429345 0.429347 -0.672325 -0.672339 -0.324554 -0.324565 -0.365468 -0.365465 -0.226285 -0.226272 -0.229523 -0.229523 -0.248931 -0.248932 0.250951 0.264983 0.264971 0.250972 0.235600 0.252190 0.262501 0.262514 0.252193 0.235597 0.282300 0.282298 0.241368 0.241368 0.225958 0.225958 0.224813 0.224813 0.228851 0.228852
chargesum: 0.00000
title: Mulliken charges with hydrogens summed into heavy atoms:
elementType: O O N N C C C C C C C C C C C C C C C C C C
charge: -0.268314 -0.268309 -0.227966 -0.227959 -0.021341 -0.021340 0.201779 0.201767 0.429345 0.429347 0.077967 0.077965 -0.042255 -0.042267 -0.124101 -0.124097 -0.000327 -0.000315 -0.004710 -0.004709 -0.020080 -0.020080
polarizability: 3.33258549e+02 -6.32776383e+00 2.07991543e+02 1.56656711e+01 1.51044596e+01 1.12077853e+02
1716.lowfreq: -4.5329 -0.0007 -0.0001 0.0007 2.2760 7.3643 7.8200 22.1732 40.0464
frequency: 7.8200 22.1732 40.0464 40.6434 45.2301 46.0566 97.2919 99.6841 139.7600 144.8693 165.1548 177.3998 185.3114 197.2690 217.9592 268.6514 291.2791 329.9425 351.7800 353.7185 391.1086 394.0138 407.0512 409.0518 436.0013 497.3564 497.9803 555.8516 556.9111 567.3510 593.2817 601.0155 614.3892 615.5507 634.2409 692.8901 693.3677 715.3358 761.5949 764.7219 770.4917 813.3078 830.9348 831.3227 865.4316 886.2747 905.8471 905.9372 964.5773 964.5799 985.6599 985.6986 988.5196 988.5370 1006.6562 1028.1186 1028.4088 1061.6592 1080.4214 1087.0376 1097.1894 1099.4552 1108.8315 1117.2187 1117.5396 1130.4357 1144.7578 1173.7751 1173.8500 1196.0535 1196.0635 1211.7570 1228.3112 1262.6943 1288.2974 1304.0368 1319.3885 1330.5203 1343.4488 1369.5443 1382.8541 1382.8773 1436.1834 1441.0526 1442.4463 1442.7292 1444.7939 1445.6454 1485.2411 1486.0087 1489.6107 1491.2612 1493.6421 1494.3963 1574.1075 1581.6370 1592.1398 1594.0211 1613.2303 1614.2632 2977.4671 2977.5226 2991.4920 2999.5809 3043.0036 3064.0815 3080.2578 3080.2869 3124.2376 3124.3511 3127.2964 3127.3000 3137.4326 3137.4347 3152.5794 3152.5848 3165.9703 3166.0168 3206.5076 3206.5265
redmass: 4.2832 5.4485 5.2109 4.5397 4.4155 5.7580 4.3264 3.5322 3.6878 2.6564 2.6206 3.2098 1.3105 1.4699 2.9555 3.4123 5.1519 7.2950 3.6382 3.4525 4.8925 3.7135 2.9574 2.8873 2.9885 3.2826 3.0623 4.4710 2.4404 3.6119 4.9984 4.9673 6.1295 6.2216 5.0122 1.9294 1.8639 5.6348 2.5399 1.8096 2.8294 1.6534 1.2582 1.2522 3.6552 3.5299 1.4511 1.4756 1.3726 1.3727 2.5682 2.5495 1.8498 1.8620 2.2271 2.4091 2.3320 2.4638 1.8280 1.9289 1.7291 1.8261 1.7001 1.6691 1.7730 2.0855 1.1661 1.0513 1.0506 1.1242 1.1241 2.1765 3.8646 2.3173 1.1141 2.4072 1.6291 1.4140 2.4795 2.3746 8.6010 8.6388 1.1496 1.8973 1.9496 1.1533 1.2197 1.2493 2.2108 2.1660 1.0614 1.0903 1.0708 1.0572 8.3888 6.7530 6.8072 7.0978 6.2547 6.3284 1.0443 1.0442 1.0640 1.0618 1.0955 1.0989 1.0911 1.0912 1.0992 1.0992 1.0854 1.0854 1.0895 1.0895 1.0938 1.0938 1.1000 1.1000 1.0946 1.0946
irintensity: 1.8092 5.1104 2.6460 0.0001 7.0408 0.0002 0.0000 2.8312 12.1606 0.0000 0.0000 0.0000 0.4144 0.0000 9.1348 0.0000 14.2810 0.0000 2.6705 0.0000 16.9506 0.0000 0.4360 0.0000 8.2368 0.0000 16.7367 0.0000 1.2882 0.0000 47.6157 2.9380 0.0000 2.6570 0.0000 87.6343 0.0001 8.0691 0.0000 123.3500 0.0000 21.7142 3.3666 0.0000 25.0801 0.0000 10.2487 0.0012 0.9105 0.0274 0.0000 0.1512 0.0002 0.3689 0.0000 0.0002 31.7571 0.0000 83.9918 0.0000 96.6035 0.0000 201.9916 0.0000 2.3946 0.0000 3.5437 0.6219 0.0000 2.9276 0.0376 46.3018 0.0000 6.2110 0.0001 0.0000 269.1385 0.0000 536.9168 0.0000 0.0044 0.4469 0.0000 30.6520 0.0000 50.9585 0.0000 17.8013 217.9292 0.0014 70.3584 0.0002 53.8326 0.0012 313.7192 0.0000 71.3730 0.0000 84.5918 0.0002 0.5448 81.5390 0.0000 22.0343 0.0000 19.5176 0.0518 39.5248 40.7329 0.0522 0.2136 0.0049 21.1176 1.7218 14.5594 56.6002 44.6042 0.0685 1.2237 0.8496
temp: 298.150 k
press: 1.00000 atm
elementType: 8 8 7 7 6 6 6 6 6 6 6 6 6 6 6 6 6 6 6 6 6 6 1 1 1 1 1 1 1 1 1 1 1 1 1 1 1 1 1 1 1 1
symmnumber: 1
zpe: 895905.9 jmol-1
zpe.correction: 0.341233 hartree
zpe.thermalcorrener: 0.362156 hartree
zpe.thermalcorrenthalpy: 0.363100 hartree
zpe.thermalcorrgfe: 0.287794 hartree
zpe.sumelectzpe: -956.280120 hartree
zpe.sumelectthermal: -956.259196 hartree
zpe.sumelectthermalent: -956.258252 hartree
zpe.sumelectthermalfe: -956.333559 hartree
dipole: 0.0002 0.0002 0.0007
dipole: 0.0008
quadrupole: -114.5484 -120.6405 -132.9269
quadrupole: 16.5027 -1.4575 5.0246
quadrupole: 8.1569 2.0648 -10.2217 16.5027 -1.4575 5.0246
hfenergy: -956.6213521 hartree
pointgroup: C01 [X(C18H20N2O2)]
dipole: -0.0000644 -0.0000975 0.000272 debye
polarizability: 333.4888044|-6.9006943|209.4266493|-13.1742175|-10.0698409|110.4124916 unknown
InChI: InChI=1S/C18H20N2O2/c1-19(15-9-5-3-6-10-15)17(21)13-14-18(22)20(2)16-11-7-4-8-12-16/h3-12H,13-14H2,1-2H3
charge 0 multiplicity 1
42 atoms
O  2.053405 -1.419299 -0.209469
O  -2.032594 1.378686 0.291176
N  3.062377 0.617987 0.386258
N  -3.041579 -0.658717 -0.304186
C  0.566043 0.461011 0.263932
C  -0.545265 -0.501762 -0.181778
C  1.944912 -0.199671 0.127995
C  -1.924122 0.158983 -0.046028
C  4.418577 0.145689 0.216749
C  -4.397807 -0.186427 -0.134841
C  2.884703 2.049758 0.726713
C  -2.863851 -2.09054 -0.644392
C  4.787862 -1.193522 0.517699
C  -4.767154 1.152702 -0.436085
C  5.417409 1.052817 -0.22915
C  -5.396617 -1.093519 0.311187
C  6.130214 -1.602498 0.372937
C  -6.109537 1.561632 -0.291473
C  6.757944 0.632552 -0.366443
C  -6.737181 -0.673298 0.448332
C  7.124449 -0.698164 -0.066872
C  -7.103745 0.657336 0.148474
H  0.384354 0.767606 1.312532
H  0.508414 1.394172 -0.324885
H  -0.487731 -1.434874 0.407124
H  -0.363494 -0.808458 -1.230335
H  2.815593 2.691285 -0.17347
H  3.739962 2.38445 1.334829
H  1.972092 2.19321 1.322507
H  -1.951189 -2.234067 -1.240093
H  -3.719054 -2.425349 -1.252521
H  -2.794798 -2.731919 0.255902
H  4.028741 -1.903749 0.845739
H  -4.008061 1.862903 -0.764239
H  5.153193 2.082583 -0.489955
H  -5.132363 -2.123218 0.572214
H  6.398895 -2.637806 0.61119
H  -6.378264 2.596876 -0.529956
H  7.512014 1.346923 -0.715485
H  -7.491228 -1.387641 0.79748
H  8.164206 -1.025148 -0.174768
H  -8.143525 0.984285 0.256252
