program: Gaussian 09
title: 000231178
version: EM64L-G09RevD.01
frameworkgroup: C1[X(C11H12O2)]
method: RPBEPBE
basis: SDD
operation: Freq
keyword: #pfreq=noraman
keyword: PBEPBE/SDD
title: #p freq=noraman PBEPBE/SDD
converged: YES YES NO NO
title: Mulliken charges:
elementType: O O C C C C C C C C C C C H H H H H H H H H H H H
charge: -0.204553 -0.263459 -0.172791 -0.566824 0.309549 0.178603 -0.018461 -0.719763 -0.372386 -0.509361 0.329688 -0.341824 -0.536371 0.252612 0.234079 0.235587 0.248720 0.216454 0.216628 0.245840 0.286075 0.253677 0.226529 0.226104 0.245649
chargesum: 0.00000
title: Mulliken charges with hydrogens summed into heavy atoms:
elementType: O O C C C C C C C C C C C
charge: -0.204553 -0.263459 0.079820 -0.097158 0.309549 0.178603 -0.018461 -0.037962 -0.126546 -0.223285 0.329688 -0.088147 0.161911
polarizability: 1.72528982e+02 -5.66535819e-01 1.34607575e+02 -2.41644012e+00 7.39440487e-01 6.78679350e+01
1716.lowfreq: 0.0002 0.0002 0.0004 6.0421 7.5213 16.8748 46.3220 84.8294 139.9929
frequency: 45.9627 84.7755 139.9926 147.5188 156.6496 213.1273 227.3828 246.1096 279.4981 325.2931 344.0602 402.6777 431.8537 482.4599 522.3342 529.9370 567.4766 600.8606 681.2842 695.5745 756.0908 764.1059 830.8431 844.9438 885.6082 900.4419 911.1515 967.4629 973.3952 993.5788 1041.7973 1088.3885 1107.2820 1113.5995 1121.1862 1154.4556 1173.2658 1175.7327 1191.6996 1223.8268 1242.8908 1274.9139 1278.5944 1304.2670 1386.2185 1393.7285 1429.6030 1442.8530 1458.6889 1466.6908 1472.0876 1473.0803 1480.2091 1484.8889 1587.0121 1618.6007 1627.8391 2963.3063 2975.1761 2983.0154 2986.3258 3039.2011 3052.3077 3079.1602 3091.0117 3129.0414 3133.7889 3162.1260 3166.2391
redmass: 3.4609 2.8904 4.5358 3.3945 3.7320 1.0916 1.4368 2.0391 4.6715 3.3830 3.1541 3.9948 3.0960 4.4324 4.0134 4.1914 4.0755 6.0739 3.9799 4.1023 4.6710 3.5783 1.4817 3.5121 1.5444 2.6334 1.4507 1.3566 3.2044 3.0442 1.7727 2.1646 1.9085 1.2614 1.9322 1.3374 1.5410 1.7960 2.0789 1.5115 1.8539 1.6701 1.6116 2.1669 1.2442 5.3037 1.7532 2.0507 1.1731 1.0491 1.1267 1.0595 1.0612 2.1179 8.0898 8.1653 9.9297 1.0329 1.0821 1.0381 1.0593 1.1003 1.1041 1.1003 1.0999 1.0998 1.0895 1.0917 1.0954
irintensity: 1.9995 7.0499 0.1538 2.6651 4.2725 1.2917 1.7288 3.6749 0.6202 7.5995 1.0999 2.4298 3.5410 14.2350 5.0008 0.1073 4.7046 2.0552 1.3972 2.8245 23.6586 16.0114 25.9139 21.6764 22.2794 1.4053 5.0376 0.4329 50.4222 16.3403 4.7618 1.5024 4.9147 0.1541 3.1635 4.5424 16.5512 31.7728 31.1815 24.1994 48.4723 115.6184 20.2132 50.2516 20.7463 18.8337 38.3874 9.1305 39.9839 14.3423 82.5981 12.4534 4.8580 87.6376 15.2492 126.3299 125.1212 53.9856 9.3122 23.3517 40.5625 18.1287 44.8155 38.7276 16.1643 25.4374 12.2489 5.2748 10.2023
temp: 298.150 k
press: 1.00000 atm
elementType: 8 8 6 6 6 6 6 6 6 6 6 6 6 1 1 1 1 1 1 1 1 1 1 1 1
symmnumber: 1
zpe: 529506.4 jmol-1
zpe.correction: 0.201678 hartree
zpe.thermalcorrener: 0.213561 hartree
zpe.thermalcorrenthalpy: 0.214505 hartree
zpe.thermalcorrgfe: 0.163688 hartree
zpe.sumelectzpe: -575.865028 hartree
zpe.sumelectthermal: -575.853145 hartree
zpe.sumelectthermalent: -575.852201 hartree
zpe.sumelectthermalfe: -575.903018 hartree
dipole: -0.7015 2.1515 -0.0327
dipole: 2.2632
quadrupole: -68.2474 -77.1770 -77.6198
quadrupole: 12.8369 -0.6123 -0.6014
quadrupole: 6.1006 -2.8289 -3.2717 12.8369 -0.6123 -0.6014
hfenergy: -576.0667061 hartree
pointgroup: C01 [X(C11H12O2)]
dipole: -0.3061891 0.835374 -0.0355716 debye
dipolederiv: -0.6198808 0.0962719 0.0055382 0.3082383 -1.0948318 -0.003315 0.0081342 0.0188063 -0.3243282 -1.4909988 -0.5674947 0.0325426 -0.5959832 -0.6026792 0.017354 0.0405882 0.0197423 -0.3016072 -0.2973508 -0.2095224 0.0059345 -0.1640744 -0.0841942 0.0288964 0.0403276 0.0731223 0.1179488 -0.0659703 0.0198903 -0.0212718 -0.0389662 0.0025742 -0.0165649 -0.0695758 -0.0449753 0.1599164 0.1817272 0.1615346 0.0055991 -0.0203894 -0.0779864 0.0108298 0.0412171 0.0093903 -0.0583072 -0.5758336 0.4853901 0.0114854 0.2505913 -0.2326261 -0.0090003 0.0302641 -0.0130419 0.0084804 1.3044637 -0.3276482 -0.0601655 -0.3486935 1.2120892 -0.0058366 -0.1261409 -0.0466515 0.0998494 0.0902954 0.0554586 -0.0444005 -0.0183192 0.0314671 0.0066437 0.0181586 0.0183449 0.0704789 -0.1074545 -0.1072781 -0.0100269 0.0050771 0.2191557 0.0020116 0.0000644 0.0025498 -0.1504519 -0.2543331 -0.3206941 -0.0023061 0.2516082 0.0301556 -0.0042779 -0.0005665 0.012489 -0.1669226 1.4473084 0.6039733 -0.041189 0.4843593 -0.0426296 -0.0132583 -0.0501691 -0.0203257 0.0911812 -0.1682718 -0.0009966 -0.001081 -0.3291116 0.0194018 0.009265 0.0019448 -0.0003012 -0.1462174 0.3708687 0.1257845 -0.0011223 0.5024796 0.6151991 -0.0140884 -0.003406 -0.0050391 0.3202689 0.0482205 0.0143691 0.0346966 -0.0052401 0.0611506 -0.0198897 0.0389531 -0.0294696 -0.1011968 -0.0071339 -0.0461837 0.0384509 -0.0314195 -0.0182824 0.090085 0.081178 0.1286532 -0.0125771 -0.0241696 -0.0522061 -0.0485175 -0.0208218 0.0469121 -0.055978 -0.0814038 -0.1045315 -0.0605904 0.0740743 0.0351749 -0.0057296 0.1340964 -0.0815112 -0.0078795 -0.0054118 -0.0315185 0.0888394 -0.1196847 -0.0919968 0.0034419 -0.155626 0.0086393 0.0266163 0.0116109 0.0402427 0.066498 0.047381 0.0188064 0.0894951 0.010583 0.0779887 -0.0455785 0.0104194 -0.023213 -0.1351437 0.0774607 -0.05609 0.0028949 -0.015841 -0.1081498 0.0001715 0.0013972 0.0004945 0.149825 0.1029803 -0.0166032 0.0025084 -0.0839201 -0.0142801 0.0014556 0.0075942 0.0000778 0.167446 -0.009334 0.0856937 0.0045652 0.076099 0.0508009 -0.0023903 0.0052218 -0.0011015 0.1616175 0.0716407 0.0801805 -0.1061824 -0.0858221 -0.0482897 0.0669202 -0.0471374 0.0905131 -0.0796103 0.0816953 0.0741836 0.0953269 -0.0902346 -0.0498593 -0.0628049 0.0364415 -0.0964654 -0.089112 -0.1577004 -0.0599977 0.0095127 -0.0186694 0.0797854 0.0006133 0.0102965 0.002208 0.1237151 unknown
polarizability: 172.5742712|0.7839406|134.6154553|-0.5692223|-0.7070696|67.8147656 unknown
InChI: InChI=1S/C11H12O2/c1-7-5-8-3-4-9(13-2)6-10(8)11(7)12/h3-4,6-7H,5H2,1-2H3
charge 0 multiplicity 1
25 atoms
O  1.681645 -2.274039 -0.06861
O  -3.452202 -0.168823 0.068624
C  2.720789 -0.007512 -0.269032
C  2.069554 1.39947 -0.0852
C  0.568504 1.137521 -0.070188
C  0.286279 -0.24841 -0.068741
C  1.555458 -1.019816 -0.122505
C  3.892808 -0.326249 0.682855
C  -0.505013 2.056863 -0.031867
C  -1.030719 -0.761919 -0.018116
C  -2.09233 0.168887 0.020784
C  -1.826072 1.570623 0.010944
C  -3.786196 -1.596501 0.08626
H  3.082544 -0.109894 -1.313542
H  2.360312 2.105159 -0.885223
H  2.396684 1.852308 0.871562
H  4.212522 -1.374891 0.552297
H  4.756494 0.333856 0.485027
H  3.590479 -0.19184 1.737788
H  -0.323752 3.137539 -0.033255
H  -1.182679 -1.845201 -0.0143
H  -2.682026 2.252497 0.039595
H  -3.360755 -2.0962 0.977982
H  -3.425632 -2.103472 -0.829594
H  -4.884396 -1.634857 0.125854
