program: Gaussian 09
title: 000231171
version: EM64L-G09RevD.01
frameworkgroup: C1[X(C14H28N2O4)]
method: RPBEPBE
basis: SDD
operation: Freq
keyword: #p
keyword: freq=noraman
keyword: PBEPBE/SDD
title: #p freq=noraman PBEPBE/SDD
converged: YES YES NO NO
title: Mulliken charges:
elementType: O O O O N N C C C C C C C C C C C C C C H H H H H H H H H H H H H H H H H H H H H H H H H H H H
charge: -0.307231 -0.307222 -0.302930 -0.302930 -0.148016 -0.148030 -0.370314 -0.370310 -0.301738 -0.301741 -0.348874 -0.353911 -0.348883 -0.353903 0.307974 0.308001 -0.657804 -0.654454 -0.657803 -0.654458 0.194612 0.244216 0.244277 0.194607 0.215452 0.236419 0.236391 0.215451 0.205556 0.247550 0.206996 0.254358 0.247556 0.205556 0.254356 0.206991 0.211004 0.240136 0.213387 0.206735 0.245801 0.215054 0.211001 0.240132 0.213389 0.206734 0.245802 0.215055
chargesum: 0.00000
title: Mulliken charges with hydrogens summed into heavy atoms:
elementType: O O O O N N C C C C C C C C C C C C C C
charge: -0.307231 -0.307222 -0.302930 -0.302930 -0.148016 -0.148030 0.068514 0.068574 0.150134 0.150101 0.104233 0.107443 0.104230 0.107444 0.307974 0.308001 0.006723 0.013136 0.006720 0.013133
polarizability: 2.38293577e+02 1.38427203e-03 1.73912115e+02 1.12132830e+01 -1.29907255e-03 1.41966264e+02
1716.lowfreq: -3.8112 -0.0004 0.0007 0.0012 3.9173 13.3888 15.8560 16.7820 19.6575
frequency: 15.8238 16.7445 19.3328 32.1919 32.9985 52.0243 54.1826 58.0685 63.2307 87.8129 94.1195 98.1957 104.2780 124.8281 127.6356 166.7543 179.5317 199.0915 212.9768 213.5028 231.4190 255.7195 261.9391 310.3389 312.8262 328.8731 341.0146 354.3930 363.4013 405.7601 433.4376 464.4471 489.7010 553.6873 565.7560 580.0475 589.7922 695.0089 695.4170 725.8422 728.9404 759.4245 778.6228 778.8050 784.1599 786.8988 809.3956 877.4532 884.6911 932.4905 940.9385 943.0170 966.6805 985.5236 1034.0763 1042.3979 1046.9715 1053.2875 1077.6751 1077.7186 1083.6222 1083.8403 1091.6728 1098.1200 1098.2344 1143.2878 1150.8556 1153.9680 1200.6671 1218.4124 1218.7636 1252.8075 1256.1776 1259.2970 1275.3949 1292.0665 1301.1413 1307.6457 1307.8262 1332.9097 1345.9087 1345.9515 1360.7126 1361.7126 1368.2727 1368.9418 1382.8450 1382.8853 1384.2667 1384.3073 1404.3149 1404.9311 1449.2024 1452.8503 1457.7995 1457.8381 1466.7988 1466.8205 1468.1548 1468.2857 1471.3317 1476.1611 1476.8578 1481.6330 1481.6953 1483.9550 1485.1806 1485.3856 1641.1463 1643.5336 2983.1309 2983.1388 2983.5013 2983.7154 2983.7546 2988.6829 2999.9016 2999.9192 3006.6502 3006.7586 3017.6732 3018.9808 3038.9336 3058.2628 3066.9295 3066.9453 3070.1101 3070.1278 3083.5256 3083.5443 3085.5802 3085.6038 3093.2195 3098.5098 3099.6082 3099.6516 3101.4459 3101.5099
redmass: 3.7536 4.0837 3.6376 3.6774 4.0648 2.7139 2.5957 2.5685 3.2071 4.4596 5.0628 3.1006 1.9976 3.5336 3.8882 5.3416 2.1379 1.4899 1.0680 1.0472 1.6547 1.5832 1.9709 2.8666 2.7179 3.1479 3.6385 3.6246 2.6905 2.4614 3.5421 4.5719 3.3935 3.7166 3.9288 3.6003 3.4537 10.8210 10.7798 3.0721 3.1076 1.1509 1.1595 1.1561 1.1885 1.2322 1.3622 3.1576 2.8919 1.3920 2.1120 1.9235 3.8691 3.8497 3.2958 3.7713 3.3374 4.1813 2.0241 2.0237 1.8794 1.8801 3.1854 1.7736 1.7716 2.4028 2.4825 1.8515 1.3023 2.7733 2.7203 1.2459 1.5673 1.5636 1.2020 1.0523 1.1197 1.3493 1.3494 1.2969 1.2481 1.2482 1.2959 1.3166 1.3239 1.4397 1.2168 1.2172 1.2235 1.2209 2.0490 1.9636 1.1072 1.1114 1.0708 1.0699 1.0463 1.0465 1.0506 1.0514 1.0735 1.0968 1.1018 1.0598 1.0599 1.1037 1.0749 1.0817 8.1826 8.2277 1.0356 1.0356 1.0592 1.0356 1.0365 1.0611 1.0641 1.0641 1.0649 1.0649 1.0575 1.0574 1.0977 1.1032 1.0993 1.0993 1.0991 1.0991 1.0985 1.0985 1.0975 1.0975 1.1093 1.1084 1.1021 1.1023 1.1022 1.1023
irintensity: 0.1632 0.2311 2.1109 0.0035 0.5951 0.1213 1.0504 0.0161 0.2148 0.1574 7.5473 0.8031 1.4537 0.2882 0.0024 3.0638 1.6833 0.4677 0.0340 0.7794 0.0838 0.8666 4.9168 0.6099 0.0495 27.6934 3.4042 15.8893 14.7189 4.4076 8.4629 3.9021 9.9816 3.2130 0.2496 2.2236 1.8854 1.9488 40.4804 23.1557 9.7114 3.5984 2.1341 9.7183 23.6550 0.0966 0.8628 0.1950 4.8656 2.5488 5.3213 4.1671 254.1223 17.3496 4.8100 12.9157 19.2722 204.0138 12.5385 12.0460 1.9817 3.6615 0.2136 15.6928 28.0327 446.8183 34.5734 6.6838 1.0737 4.7966 50.9758 59.4708 297.3151 45.6142 6.4218 4.2715 0.0000 15.7964 30.1068 2.8389 1.3313 7.5809 0.5355 15.3309 55.8972 4.4351 4.7409 2.0710 28.7650 54.0615 50.2221 146.6348 76.2736 0.9450 26.4355 12.7998 1.8285 3.0029 12.5355 3.8916 0.0158 26.9315 17.8563 7.1564 14.9961 20.9168 27.5438 2.6230 474.1111 257.3546 36.9266 16.7355 11.5595 48.5052 3.1493 20.9317 2.8394 67.5997 92.9190 0.9599 3.8505 96.3853 1.9878 9.0557 6.2830 9.0510 3.2696 11.1060 25.2854 67.6884 26.6568 39.3361 1.1143 41.4727 5.1175 27.3484 115.8175 1.2999
temp: 298.150 k
press: 1.00000 atm
elementType: 8 8 8 8 7 7 6 6 6 6 6 6 6 6 6 6 6 6 6 6 1 1 1 1 1 1 1 1 1 1 1 1 1 1 1 1 1 1 1 1 1 1 1 1 1 1 1 1
symmnumber: 1
zpe: 1087985.8 jmol-1
zpe.correction: 0.414392 hartree
zpe.thermalcorrener: 0.439649 hartree
zpe.thermalcorrenthalpy: 0.440594 hartree
zpe.thermalcorrgfe: 0.353759 hartree
zpe.sumelectzpe: -959.078088 hartree
zpe.sumelectthermal: -959.052830 hartree
zpe.sumelectthermalent: -959.051886 hartree
zpe.sumelectthermalfe: -959.138720 hartree
dipole: 0.0005 -3.5945 0.0007
dipole: 3.5945
quadrupole: -81.0884 -127.6233 -121.3589
quadrupole: 0.0045 7.4036 0.0019
quadrupole: 28.9352 -17.5998 -11.3354 0.0045 7.4036 0.0019
hfenergy: -959.4924796 hartree
pointgroup: C01[X(C14H28N2O4)]
dipole: -0.0000255 0.0015752 1.4141706 debye
polarizability: 237.2261386|15.0805064|143.0337331|-0.0055774|0.0316743|173.9120836 unknown
InChI: InChI=1S/C14H28N2O4/c1-5-15(6-2)13(17)19-11-9-10-12-20-14(18)16(7-3)8-4/h5-12H2,1-4H3
charge 0 multiplicity 1
48 atoms
O  -3.113455 0.501049 0.756182
O  3.113238 -0.499765 0.758597
O  -3.178121 0.294126 -1.592887
O  3.178087 -0.297802 -1.590889
N  -5.047129 -0.224667 -0.267361
N  5.046954 0.223913 -0.266308
C  -0.736463 -0.236857 0.604345
C  0.736247 0.237647 0.603804
C  -1.703575 0.95531 0.633484
C  1.7034 -0.954384 0.636713
C  -5.665973 -0.314774 1.074834
C  -5.846519 -0.617693 -1.450697
C  5.66573 0.31679 1.075727
C  5.846375 0.61466 -1.450375
C  -3.748855 0.190096 -0.470485
C  3.748717 -0.191345 -0.468661
C  -5.422625 -1.678196 1.757478
C  -6.6820 0.54798 -2.020969
C  5.422459 1.681671 1.755485
C  6.682086 -0.55204 -2.018223
H  -0.929287 -0.87794 1.487571
H  -0.942221 -0.838418 -0.300597
H  0.94219 0.836542 -0.30286
H  0.928847 0.88134 1.485183
H  -1.548058 1.581048 1.529021
H  -1.600577 1.564648 -0.282289
H  1.60074 -1.566408 -0.27731
H  1.547609 -1.57752 1.534014
H  -6.751398 -0.13789 0.951344
H  -5.264131 0.49496 1.704944
H  -6.503781 -1.456571 -1.15209
H  -5.14981 -0.987003 -2.222045
H  5.263803 -0.491592 1.707513
H  6.751148 0.139569 0.952663
H  5.149673 0.982302 -2.222523
H  6.503487 1.454237 -1.153402
H  -5.803784 -2.511072 1.138704
H  -4.34282 -1.832258 1.924432
H  -5.935111 -1.715394 2.736696
H  -7.370344 0.962089 -1.261287
H  -6.017692 1.357152 -2.369424
H  -7.287672 0.202638 -2.879189
H  5.803649 2.513206 1.134929
H  4.342665 1.836146 1.922125
H  5.93496 1.720929 2.734614
H  7.370406 -0.964523 -1.257639
H  6.017929 -1.362002 -2.365125
H  7.287804 -0.208335 -2.877069
