program: Gaussian 09
title: 000231165
version: EM64L-G09RevD.01
frameworkgroup: C1[X(C20H20N2O8)]
method: RPBEPBE
basis: SDD
operation: Freq
keyword: #p
keyword: freq=noraman
keyword: PBEPBE/SDD
title: #p freq=noraman PBEPBE/SDD
converged: YES YES NO NO
title: Mulliken charges:
elementType: O O O O O O O O N N C C C C C C C C C C C C C C C C C C C C H H H H H H H H H H H H H H H H H H H H
charge: -0.308943 -0.308943 -0.259680 -0.259679 -0.442797 -0.442796 -0.256971 -0.256971 -0.459314 -0.459315 -0.386350 -0.386350 -0.262473 -0.262473 0.257789 0.257789 0.495663 0.495663 -0.440555 -0.440554 -0.342576 -0.342575 0.264285 0.264285 -0.335187 -0.335188 -0.321769 -0.321769 0.105156 0.105156 0.216161 0.216178 0.216166 0.216173 0.230797 0.230749 0.230767 0.230779 0.334972 0.334972 0.230056 0.230056 0.303270 0.303269 0.272689 0.272690 0.274964 0.274964 0.383885 0.383885
chargesum: 0.00000
title: Mulliken charges with hydrogens summed into heavy atoms:
elementType: O O O O O O O O N N C C C C C C C C C C C C C C C C C C C C
charge: -0.308943 -0.308943 -0.259680 -0.259679 -0.058912 -0.058911 -0.256971 -0.256971 -0.124342 -0.124343 0.045989 0.045989 0.199073 0.199073 0.257789 0.257789 0.495663 0.495663 -0.210498 -0.210498 -0.039306 -0.039306 0.264285 0.264285 -0.062498 -0.062498 -0.046805 -0.046805 0.105156 0.105156
polarizability: 5.22997352e+02 7.13098438e+00 2.43981362e+02 -1.44918750e-02 1.40191326e-03 1.17296336e+02
1716.lowfreq: -8.1575 -6.7078 -0.0019 0.0012 0.0017 1.1621 2.1074 10.0180 13.4718
frequency: -6.7078 10.0180 13.4718 18.0916 44.5932 44.9328 50.8127 60.3754 62.0292 82.1154 83.6849 86.1956 95.7758 96.0733 102.2181 121.9945 135.8387 144.1189 170.9634 181.6049 182.0736 216.5493 221.3315 280.4515 297.7124 299.4535 299.4561 340.7003 344.2129 385.3651 401.9697 412.9084 412.9089 465.7555 469.6045 492.9797 497.4117 503.8998 503.9912 587.3006 587.3180 589.5545 595.1372 627.3993 628.2416 654.7290 654.8789 687.2082 687.2758 698.6208 704.6551 706.7792 707.3491 734.2130 740.7746 755.4012 760.7084 760.7367 798.6441 832.0057 835.4828 842.5210 842.5535 877.5476 877.6234 909.9827 911.4597 921.9720 982.3699 982.3748 996.3357 997.5710 1000.5202 1004.6303 1004.6358 1013.4023 1021.8218 1023.8665 1054.1528 1066.7744 1111.2801 1126.0876 1126.2900 1137.1257 1151.8131 1152.0788 1155.6043 1163.4746 1176.1312 1196.6437 1196.6442 1243.5370 1259.6934 1267.3755 1268.1404 1281.9491 1283.9467 1310.8277 1311.0574 1323.7695 1323.8963 1332.1336 1369.2608 1376.0212 1385.5684 1387.6557 1428.0976 1428.1453 1472.6299 1473.3225 1483.6856 1491.6442 1497.2895 1497.6319 1518.6161 1521.1094 1588.0029 1588.2697 1623.5392 1623.9856 1640.6888 1640.7234 1666.8080 1666.9564 2990.7882 2995.7001 3003.5280 3007.1988 3035.5575 3050.8270 3072.6577 3084.6131 3122.5721 3122.5733 3164.9140 3164.9234 3172.0553 3172.0560 3195.3221 3195.3349 3532.1561 3532.1714 3536.7715 3536.8015
redmass: 6.0003 6.3871 7.4975 7.6707 8.2523 6.2684 3.4085 10.8189 8.1105 3.4198 5.4816 3.4916 8.6158 6.3676 3.2203 2.8997 4.0393 8.0361 5.0611 6.6971 3.9649 7.0359 8.3719 5.9077 8.6306 4.9928 4.9965 7.2015 5.7714 5.9310 6.0014 2.9560 2.9560 4.9428 5.1739 6.9452 5.9985 2.6702 2.6739 1.2213 1.2212 5.1435 4.9169 7.1330 7.0792 1.4303 1.4334 3.6263 3.6249 7.4906 6.4305 4.0126 3.9947 6.0375 6.3847 1.0665 4.4533 4.4538 1.1413 5.9187 5.7913 1.3837 1.3830 1.5262 1.5269 9.1312 8.1061 1.2082 1.3658 1.3658 5.4485 4.6324 6.6652 1.3376 1.3376 7.1744 2.7582 2.9989 3.4476 3.7989 2.9900 1.3336 1.3316 1.5870 1.6362 1.6173 3.2917 3.4372 1.1755 1.1824 1.1824 1.2244 1.2975 1.9845 1.9299 1.1501 1.0619 1.4540 1.4433 2.8995 2.9341 1.3238 1.9749 2.9366 2.4301 2.0842 4.3548 4.3589 1.0776 1.0960 1.1214 1.2976 2.0122 1.6044 3.0622 3.0978 4.9437 4.8722 6.0570 6.0884 8.5400 8.5528 8.3822 8.3116 1.0601 1.0591 1.0572 1.0565 1.1011 1.1049 1.1095 1.1076 1.0901 1.0901 1.0950 1.0950 1.0902 1.0902 1.0959 1.0959 1.0642 1.0642 1.0761 1.0761
irintensity: 0.6652 0.0128 0.3171 0.0000 0.0010 0.3243 0.0000 11.1539 0.0000 0.0000 0.0482 0.0000 0.0000 2.1234 0.0300 1.5000 0.0000 0.0000 15.4894 6.5765 0.0008 0.0000 1.2664 42.3674 0.0000 0.0013 0.2444 17.1230 0.0000 0.0000 16.0751 0.2011 0.7979 0.0000 44.8765 0.0000 20.2777 0.0033 120.0189 7.1799 140.2140 71.1689 0.0000 0.0000 1.7461 0.0272 48.9650 0.0008 167.3331 0.0000 5.0484 0.0004 93.8035 0.0000 42.1415 6.8923 0.0003 53.6275 0.0000 7.3257 0.0000 0.0008 59.2534 0.0448 115.6019 0.0000 14.6511 0.2313 0.0270 0.3858 693.8302 0.0003 185.3243 0.0427 1.0058 0.0000 627.8849 0.0005 0.0000 414.4637 0.0000 61.7369 0.0001 0.0003 557.1479 0.0086 1037.7666 0.0001 1.9245 10.1051 9.6573 0.0000 23.5657 0.0000 1.6439 1.1851 0.0000 172.1824 0.0001 276.6853 0.0023 0.0000 266.1658 0.0000 50.5887 0.0000 57.9572 0.0042 0.0000 43.6537 0.0000 316.1757 0.0008 195.2550 1220.5740 0.0001 65.6381 0.0000 663.3375 0.0005 579.8063 1.9404 316.4157 0.0071 0.0000 6.5638 0.0000 80.3253 0.0000 0.1342 0.0000 96.9070 14.6518 12.4275 3.2653 3.9281 0.5947 0.8819 2.6064 1.8782 88.6113 22.5684 3.2731 64.5038
temp: 298.150 k
press: 1.00000 atm
elementType: 8 8 8 8 8 8 8 8 7 7 6 6 6 6 6 6 6 6 6 6 6 6 6 6 6 6 6 6 6 6 1 1 1 1 1 1 1 1 1 1 1 1 1 1 1 1 1 1 1 1
symmnumber: 1
zpe: 994442.8 jmol-1
zpe.correction: 0.378763 hartree
zpe.thermalcorrener: 0.406804 hartree
zpe.thermalcorrenthalpy: 0.407749 hartree
zpe.thermalcorrgfe: 0.314814 hartree
zpe.sumelectzpe: -1483.314663 hartree
zpe.sumelectthermal: -1483.286622 hartree
zpe.sumelectthermalent: -1483.285678 hartree
zpe.sumelectthermalfe: -1483.378612 hartree
dipole: 0.0000 0.0000 0.0043
dipole: 0.0043
quadrupole: -246.4017 -170.1949 -176.3793
quadrupole: -10.9395 0.0031 0.0003
quadrupole: -48.7430 27.4637 21.2793 -10.9395 0.0031 0.0003
hfenergy: -1483.6934261 hartree
pointgroup: C01 [X(C20H20N2O8)]
dipole: -0.000002 -0.0000057 0.0017099 debye
polarizability: 523.06959|5.5398421|243.9091041|0.0261904|0.0488178|117.2963554 unknown
InChI: InChI=1S/C20H20N2O8/c23-17(24)13-3-7-15(8-4-13)21-19(27)29-11-1-2-12-30-20(28)22-16-9-5-14(6-10-16)18(25)26/h3-10,21-23,25H,1-2,11-12H2
charge 0 multiplicity 1
50 atoms
O  -3.083114 -0.323999 0.007208
O  3.083122 0.323962 0.006887
O  -4.415116 1.619335 0.005674
O  4.415124 -1.619371 0.004507
O  -11.464218 1.397304 0.001407
O  11.464227 -1.397336 0.000965
O  -11.831333 -0.896639 0.002228
O  11.831342 0.896606 0.003711
N  -5.326051 -0.576392 0.006123
N  5.326059 0.576356 0.006451
C  -0.662602 -0.399666 0.006973
C  0.66261 0.399628 0.007322
C  -1.869944 0.538759 0.007505
C  1.869952 -0.538797 0.006463
C  -4.308118 0.369475 0.006305
C  4.308126 -0.369512 0.005831
C  -6.722973 -0.349627 0.005151
C  6.722981 0.349591 0.005571
C  -7.569251 -1.495197 0.005157
C  7.569259 1.49516 0.006588
C  -7.295303 0.952527 0.00418
C  7.295312 -0.952561 0.003706
C  -9.541855 -0.047023 0.003221
C  9.541863 0.046988 0.003865
C  -8.962893 -1.343942 0.004202
C  8.962901 1.343907 0.005742
C  -8.694604 1.090875 0.003228
C  8.694613 -1.090909 0.002864
C  -11.018892 0.062321 0.002221
C  11.018901 -0.062355 0.003022
H  -0.713766 -1.054914 -0.883606
H  -0.713662 -1.055859 0.89686
H  0.713581 1.055963 -0.882466
H  0.713863 1.054734 0.8980
H  -1.895597 1.186652 -0.88811
H  -1.895461 1.185781 0.903762
H  1.895683 -1.18691 0.901919
H  1.895391 -1.185598 -0.889953
H  -5.006015 -1.547927 0.006729
H  5.006022 1.547889 0.007621
H  -7.129024 -2.499958 0.005906
H  7.129031 2.49992 0.008038
H  -6.643852 1.828297 0.004174
H  6.64386 -1.828332 0.002938
H  -9.624204 -2.216252 0.004192
H  9.624211 2.216216 0.006512
H  -9.144409 2.087589 0.002473
H  9.144418 -2.087622 0.001414
H  -12.458728 1.396633 0.000835
H  12.458736 -1.396665 0.00038
