program: Gaussian 09
title: 000231159
version: EM64L-G09RevD.01
frameworkgroup: C1[X(C13H12O)]
method: RPBEPBE
basis: SDD
operation: Freq
keyword: #pfreq=noraman
keyword: PBEPBE/SDD
title: #p freq=noraman PBEPBE/SDD
converged: YES YES NO NO
title: Mulliken charges:
elementType: O C C C C C C C C C C C C C H H H H H H H H H H H H
charge: -0.212090 0.189457 0.234109 0.395208 0.079759 -0.386793 -0.364232 -0.503248 -0.438578 -0.432912 -0.239844 -0.264967 -0.243022 -0.683905 0.269864 0.241206 0.248254 0.246602 0.242351 0.239838 0.235184 0.230864 0.232229 0.254684 0.221112 0.208870
chargesum: 0.00000
title: Mulliken charges with hydrogens summed into heavy atoms:
elementType: O C C C C C C C C C C C C C
charge: -0.212090 0.189457 0.234109 0.395208 0.079759 -0.116929 -0.117630 -0.013788 -0.196227 -0.193075 -0.004660 -0.034103 -0.010793 0.000761
polarizability: 1.84643720e+02 8.24221749e+00 1.77755958e+02 -5.41340214e+00 2.72865708e+00 7.03069586e+01
1716.lowfreq: -10.7245 -4.9896 -0.0003 0.0002 0.0006 6.4057 42.2588 82.3337 87.0475
frequency: 42.2307 82.3160 87.0465 169.3080 181.2904 190.7571 227.8401 263.4003 313.9244 335.2654 397.0472 440.4038 470.4713 501.9115 520.4409 548.1187 582.8100 642.1221 662.3201 730.6625 752.9729 784.3762 787.6816 793.6027 819.2833 829.0139 882.7784 926.3382 938.5900 966.5344 989.4357 995.9558 1002.1200 1025.5944 1040.6783 1062.5183 1080.6885 1115.4563 1152.9829 1176.9862 1188.4379 1230.0942 1236.3687 1250.0587 1279.3696 1325.6916 1369.5946 1388.0494 1401.3447 1411.0220 1438.3249 1451.1315 1465.0690 1474.5976 1485.2454 1515.9320 1562.9652 1587.7975 1595.1850 1629.5941 2985.1522 2986.3598 3068.4028 3080.7724 3102.4590 3123.7381 3126.5189 3136.5867 3146.2256 3156.3345 3164.6855 3171.0733
redmass: 4.3616 2.9624 3.8859 3.0471 4.1680 1.2909 2.8896 3.3862 3.8213 5.7996 3.8131 3.8366 3.2622 4.6107 6.0483 3.8238 3.2461 3.9429 4.4638 2.3895 1.6445 2.3501 2.0923 1.7454 2.0506 2.5274 1.7226 2.7269 1.5856 1.3968 1.4061 1.3688 2.9548 2.4035 1.9921 1.9862 1.8867 2.1470 1.3830 1.1021 1.3004 1.4948 1.8354 1.4628 1.7631 1.7211 2.5339 1.2097 2.6444 6.3943 2.4347 2.3707 1.0880 1.0482 1.0598 3.7275 7.4643 7.0733 6.0916 6.5188 1.0649 1.0376 1.0935 1.0996 1.1000 1.0869 1.0871 1.0893 1.0914 1.0951 1.0985 1.0980
irintensity: 2.7591 0.7644 2.2692 1.3526 2.6659 0.1229 3.0694 2.4775 2.0990 7.3527 0.0389 5.6293 0.1270 8.3494 4.1015 8.1595 2.5120 1.5863 1.9370 0.2885 4.0794 14.2648 68.4525 11.8840 44.0489 8.9225 7.1262 14.1219 14.7195 4.8101 1.2600 1.5989 2.9404 6.5036 20.1589 4.5074 5.1861 16.0146 6.8321 4.6536 21.5110 41.2953 5.4870 34.4644 6.0407 46.7243 9.5830 22.9762 3.9682 1.7331 1.0647 9.7898 12.2203 11.4570 18.5688 20.9226 128.9690 6.6828 36.6811 1.3507 4.1032 37.9771 10.9359 47.0154 21.8789 0.6809 3.6451 10.3272 10.3444 28.2719 22.5407 16.3017
temp: 298.150 k
press: 1.00000 atm
elementType: 8 6 6 6 6 6 6 6 6 6 6 6 6 6 1 1 1 1 1 1 1 1 1 1 1 1
symmnumber: 1
zpe: 550566.1 jmol-1
zpe.correction: 0.209700 hartree
zpe.thermalcorrener: 0.221580 hartree
zpe.thermalcorrenthalpy: 0.222524 hartree
zpe.thermalcorrgfe: 0.171354 hartree
zpe.sumelectzpe: -576.830142 hartree
zpe.sumelectthermal: -576.818262 hartree
zpe.sumelectthermalent: -576.817318 hartree
zpe.sumelectthermalfe: -576.868488 hartree
dipole: -2.5581 -1.4668 1.6759
dipole: 3.3918
quadrupole: -79.2008 -72.9494 -87.5042
quadrupole: -6.1699 4.6114 3.1778
quadrupole: 0.6840 6.9354 -7.6194 -6.1699 4.6114 3.1778
hfenergy: -577.0398418 hartree
pointgroup: C01 [X(C13H12O1)]
dipole: -1.0352955 0.4664925 -0.7008909 debye
dipolederiv: -1.0022228 0.0483156 -0.1374087 0.1695121 -0.4343197 0.197333 -0.1667019 0.1648896 -0.5376187 -0.0004427 -0.0416655 -0.01426 -0.242814 0.08748 0.0040333 0.0928106 0.0353412 0.0108582 -0.5719095 -0.1234708 -0.0035507 -0.3462971 -0.1100662 0.052028 0.0918388 0.0975788 -0.0836366 -0.1046624 -0.104912 -0.0014689 -0.1033456 -0.0412361 -0.0022672 0.0237475 -0.0142117 0.0639667 1.5826503 0.1769232 0.0247504 0.2513119 0.3956905 -0.3916653 -0.0142653 -0.3832438 0.5643071 0.1347599 -0.0700245 0.0221006 0.1694343 -0.030349 -0.0038227 -0.0953193 -0.0574609 -0.1133402 0.0227997 0.0790672 0.017536 0.1601533 -0.0399586 -0.0101523 0.038223 0.0133832 -0.1388435 -0.1487478 -0.193837 0.13719 -0.2254263 -0.1095599 0.1197429 0.0692718 0.1472244 -0.1187004 0.1196986 0.0659202 0.0267207 -0.0494182 0.0800926 -0.0128265 0.013643 -0.0053514 -0.1587169 0.1154836 0.0020743 0.0174444 0.1028696 0.0086083 -0.0025148 0.0066043 -0.0182474 -0.1704322 -0.2238378 0.1200563 -0.009993 0.1230925 0.1070038 -0.015672 -0.0064661 -0.0166395 -0.1514062 0.0231041 0.0902217 0.0111762 0.0756254 0.1023644 0.0207108 0.0201723 0.0152748 -0.1544804 0.0743404 -0.0961119 0.0225505 -0.1215888 -0.0813116 -0.0054574 0.0100594 -0.0112557 -0.1561604 0.0642886 0.0160749 -0.071336 -0.022869 0.0563733 0.0018676 0.0249761 0.0324576 0.0316739 0.0186681 0.08752 -0.0068762 0.0583202 0.0539871 0.0037007 0.0082549 0.0207005 0.1453955 0.0304202 0.0435803 0.0687876 0.0577143 -0.0064276 -0.0756198 0.0455026 -0.0532919 0.0072498 -0.0450483 0.0345003 -0.120034 0.0183269 0.0128972 0.0557231 -0.1303679 0.0097329 0.0410711 -0.0340319 -0.0814987 -0.0284053 -0.0467391 0.0455788 0.0052747 -0.0528041 -0.0114827 0.1288385 -0.0851814 -0.0926975 -0.0110177 -0.0246666 0.062039 0.0022396 -0.0177057 0.0027262 0.1516039 -0.0806488 -0.0358756 -0.0125452 -0.1057072 0.0457217 -0.0028056 -0.0115919 0.0063765 0.1539916 0.0708808 -0.0308443 -0.0003769 -0.0459337 -0.1212347 0.0198912 0.0085316 0.0126991 0.1595269 0.0840826 -0.0330742 -0.006643 -0.0160256 -0.1223298 -0.0050524 -0.0024743 -0.0049111 0.1559736 -0.0526007 0.1086064 -0.0150506 0.1140197 0.0039148 0.0092899 -0.0161289 0.0088559 0.1611811 -0.0181674 0.0222401 -0.0735714 0.1127014 0.0705238 0.0414201 -0.1045397 0.0113525 0.0495104 0.0093194 -0.0895839 0.0694074 -0.1218196 -0.0180133 0.0895089 0.096033 0.1038492 -0.0376727 0.0170053 0.0984953 0.094874 0.0595692 -0.0174688 -0.094908 0.068696 -0.1063463 -0.0041398 unknown
polarizability: 185.2963774|-7.5207851|176.4769462|4.1884196|-9.5999099|70.9333127 unknown
InChI: InChI=1S/C13H12O/c1-2-13(14)12-9-5-7-10-6-3-4-8-11(10)12/h3-9H,2H2,1H3
charge 0 multiplicity 1
26 atoms
O  3.039336 -1.052846 0.744273
C  -0.371243 0.06206 -0.034852
C  0.738302 -0.863711 0.061001
C  -1.719732 -0.476275 -0.082933
C  2.192268 -0.464707 0.008363
C  0.486091 -2.241915 0.183015
C  -0.218673 1.490348 -0.016028
C  2.679899 0.545446 -1.041922
C  -1.922522 -1.893481 -0.008544
C  -2.836672 0.419347 -0.174979
C  -0.839538 -2.761659 0.140798
C  -1.326492 2.337969 -0.095913
C  -2.648521 1.801674 -0.191288
C  3.612102 1.625221 -0.441576
H  1.340839 -2.917554 0.292245
H  3.260638 -0.05453 -1.772695
H  1.839967 0.993021 -1.598014
H  0.777457 1.927196 0.09833
H  -2.946446 -2.283248 -0.055537
H  -3.847338 -0.003994 -0.218452
H  -0.999832 -3.842246 0.215117
H  -1.183977 3.423969 -0.074313
H  -3.507241 2.478161 -0.258345
H  4.418439 1.144861 0.138118
H  4.066768 2.23723 -1.24018
H  3.064523 2.303862 0.238808
