program: Gaussian 09
title: 000231157
version: EM64L-G09RevD.01
frameworkgroup: C1[X(C16H12O5)]
method: RPBEPBE
basis: SDD
operation: Freq
keyword: #pfreq=noraman
keyword: PBEPBE/SDD
title: #p freq=noraman PBEPBE/SDD
converged: YES YES NO NO
title: Mulliken charges:
elementType: O O O O O C C C C C C C C C C C C C C C C H H H H H H H H H H H H
charge: -0.270842 -0.264545 -0.265632 -0.253108 -0.224162 -0.685574 0.563939 0.373018 0.105631 0.200751 -0.561184 0.158113 0.191273 -0.379481 -0.456065 0.165903 -0.323542 -0.364500 -0.331220 -0.201604 -0.203584 0.262144 0.226978 0.256356 0.264087 0.265322 0.251547 0.283503 0.257452 0.237255 0.237027 0.242572 0.242175
chargesum: 0.00000
title: Mulliken charges with hydrogens summed into heavy atoms:
elementType: O O O O O C C C C C C C C C C C C C C C C
charge: -0.270842 -0.264545 -0.265632 -0.253108 -0.224162 -0.196452 0.563939 0.373018 0.105631 0.200751 -0.304828 0.158113 0.191273 -0.115394 -0.190743 0.165903 -0.071994 -0.080997 -0.073768 0.272678 0.281162
polarizability: 2.28208654e+02 1.76580530e+00 2.15919216e+02 -4.00606832e+00 -1.22644887e+01 1.30154766e+02
1716.lowfreq: -52.3487 -20.2715 -5.4453 -0.0008 -0.0006 -0.0005 2.5346 4.4556 14.7765
frequency: -52.3402 -19.8964 14.7152 21.6259 32.4654 84.8741 103.2301 124.0796 169.3337 216.5569 223.1082 250.7196 296.8057 297.7777 347.5015 381.5889 401.2694 412.5208 420.4520 451.5669 469.6128 551.9601 560.4208 577.4061 594.6952 618.1594 673.7917 677.8289 693.5638 709.7799 724.2932 727.9046 772.1388 778.5032 780.5999 824.3911 835.6173 838.2675 840.8115 866.4680 872.3616 883.9058 899.3208 942.5205 947.2302 974.8705 975.8234 978.1443 1025.9534 1058.5858 1064.2859 1064.9029 1065.5918 1118.8528 1120.1941 1128.3029 1137.2756 1151.5349 1176.6513 1226.1134 1250.9277 1262.4291 1267.7977 1284.0838 1292.7241 1363.2900 1364.5680 1383.8845 1396.5028 1441.1494 1444.9686 1460.7733 1475.0745 1478.3543 1487.5019 1488.1469 1561.3267 1601.4995 1610.2595 1625.1055 1628.5205 3007.2489 3011.3616 3018.6779 3066.6395 3088.8875 3098.6706 3145.6058 3155.2580 3161.3225 3181.2797 3185.1352 3192.7786
redmass: 2.3143 2.2776 6.6217 6.5100 5.7501 9.0986 9.2051 7.2556 6.8237 6.0277 6.2097 4.8833 7.7473 7.5767 5.8758 5.0874 5.1507 2.9630 2.9830 3.5262 5.2927 5.6491 5.7604 4.8352 6.1487 4.6858 8.5472 9.5116 8.5207 5.2866 4.3776 4.5876 3.9757 3.9433 6.4910 1.4919 6.3944 2.9617 2.0368 2.2949 1.5429 3.0010 3.3591 1.5689 2.0455 3.0612 1.8110 5.0622 2.3136 3.6879 1.4706 3.3011 1.4758 1.0363 1.0367 1.4371 1.3045 1.3913 1.6339 2.1488 5.2281 1.7273 1.3622 1.4114 3.4430 1.3850 1.2776 4.3176 4.2859 4.3156 4.6273 1.2274 2.2255 1.6576 1.3611 1.4093 9.6316 7.7709 7.8295 8.5094 8.2637 1.0590 1.0533 1.0534 1.1029 1.1191 1.1192 1.0902 1.0930 1.0892 1.0957 1.0962 1.0925
irintensity: 13.9240 13.5938 0.2324 0.0646 0.7082 2.4374 3.6671 0.4360 1.0244 0.0397 0.6379 3.3804 0.7754 0.1705 0.8718 11.3782 3.8396 7.0001 8.0682 5.4199 3.1347 17.8600 4.2808 3.5494 0.9153 29.4460 1.1356 0.0943 3.3490 2.4748 7.2991 3.3429 19.2583 54.4960 9.5805 46.4649 31.5254 7.0204 28.6304 17.0756 22.8430 2.4344 9.9634 2.5416 11.5473 85.0577 52.9508 177.3261 0.8977 16.4345 5.4284 55.1520 10.0111 0.0185 0.0126 22.1154 1.1343 36.4434 36.9899 108.0377 200.8960 110.2085 10.3011 2.3959 398.1405 7.1925 1.7300 5.0801 4.9468 28.8539 47.2604 66.2137 98.0654 104.0080 23.7428 59.0326 204.1174 9.8660 8.5104 23.9921 2.3778 20.4759 124.0993 116.9666 9.5266 33.0122 28.0862 1.4546 4.5265 0.1949 3.8475 5.9927 1.3647
temp: 298.150 k
press: 1.00000 atm
elementType: 8 8 8 8 8 6 6 6 6 6 6 6 6 6 6 6 6 6 6 6 6 1 1 1 1 1 1 1 1 1 1 1 1
symmnumber: 1
zpe: 637971.9 jmol-1
zpe.correction: 0.242991 hartree
zpe.thermalcorrener: 0.258737 hartree
zpe.thermalcorrenthalpy: 0.259681 hartree
zpe.thermalcorrgfe: 0.196772 hartree
zpe.sumelectzpe: -991.485857 hartree
zpe.sumelectthermal: -991.470110 hartree
zpe.sumelectthermalent: -991.469166 hartree
zpe.sumelectthermalfe: -991.532076 hartree
dipole: 0.6841 -3.8474 0.4933
dipole: 3.9387
quadrupole: -107.2719 -121.0645 -118.9764
quadrupole: -2.8159 0.0171 0.9452
quadrupole: 8.4990 -5.2935 -3.2055 -2.8159 0.0171 0.9452
hfenergy: -991.7288477 hartree
pointgroup: C01 [X(C16H12O5)]
dipole: 0.4040114 0.4695091 1.4204448 debye
polarizability: 226.8985092|-10.1757743|139.8987378|0.2921188|28.876365|207.4853894 unknown
InChI: InChI=1S/C16H12O5/c17-12(11-2-4-14-16(7-11)21-9-19-14)5-10-1-3-13-15(6-10)20-8-18-13/h1-4,6-7H,5,8-9H2
charge 0 multiplicity 1
33 atoms
O  -3.49508 1.550847 1.938085
O  -4.580542 -0.560381 1.551164
O  3.061734 0.911897 1.924301
O  4.735885 -0.728839 1.397144
O  0.503513 -0.694225 -3.450802
C  -0.516583 1.082024 -2.152324
C  -1.593908 0.599482 -1.175532
C  1.655114 -0.188519 -1.394997
C  0.563084 0.014321 -2.399229
C  -2.965841 0.924533 0.781708
C  -1.961592 1.407868 -0.059574
C  -3.602442 -0.312623 0.554438
C  2.784417 0.300711 0.675021
C  -2.24115 -0.643528 -1.396551
C  1.717545 0.56419 -0.17869
C  3.772122 -0.663356 0.371275
C  -3.261394 -1.122372 -0.531139
C  2.654726 -1.158909 -1.688084
C  3.733495 -1.413905 -0.809558
C  -4.536359 0.620275 2.454934
C  4.306995 0.270661 2.418956
H  -0.969151 1.291118 -3.138478
H  -0.065331 2.020858 -1.784026
H  -1.489256 2.377065 0.127957
H  -1.94741 -1.249825 -2.260138
H  0.958892 1.302269 0.087758
H  -3.75871 -2.079603 -0.706021
H  2.562397 -1.709079 -2.629478
H  4.501365 -2.157245 -1.036394
H  -5.515501 1.129051 2.430304
H  -4.248882 0.287997 3.467436
H  4.093658 -0.257013 3.364042
H  5.094692 1.036453 2.518591
