program: Gaussian 09
title: 000231113
version: EM64L-G09RevD.01
frameworkgroup: C1[X(C16H16O4)]
method: RPBEPBE
basis: SDD
operation: Freq
keyword: #pfreq=noraman
keyword: PBEPBE/SDD
title: #p freq=noraman PBEPBE/SDD
converged: YES YES NO NO
title: Mulliken charges:
elementType: O O O O C C C C C C C C C C C C C C C C H H H H H H H H H H H H H H H H
charge: -0.286153 -0.181069 -0.182289 -0.185865 -0.035416 -0.563966 0.261094 -0.170020 0.089399 -0.683112 -0.701505 0.273339 0.329679 -0.104487 -0.375004 -0.366041 -0.225217 -0.229094 0.266878 -0.745486 0.206817 0.251303 0.224885 0.220450 0.207951 0.210386 0.243201 0.204378 0.210711 0.291301 0.289692 0.242183 0.242540 0.270515 0.250246 0.247775
chargesum: 0.00000
title: Mulliken charges with hydrogens summed into heavy atoms:
elementType: O O O O C C C C C C C C C C C C C C C C
charge: -0.286153 -0.181069 -0.182289 -0.185865 0.171401 -0.087778 0.261094 -0.170020 0.089399 -0.044325 -0.043215 0.273339 0.329679 -0.104487 -0.083703 -0.076349 0.016966 0.013446 0.266878 0.023049
polarizability: 2.42240454e+02 4.84956277e+00 2.18510986e+02 -9.15283931e-01 2.31769973e+01 1.18391555e+02
1716.lowfreq: -8.3078 -0.0010 -0.0008 0.0005 2.7318 6.8196 35.3634 45.0923 46.6851
frequency: 35.1087 45.0162 46.5923 56.5102 66.7906 88.9306 107.3909 124.0580 128.4248 161.1883 184.6602 212.3356 230.6821 251.6978 269.5565 296.0147 316.5510 332.2021 367.6750 369.5388 383.6688 395.8120 417.0759 427.8135 442.4785 486.4071 493.2450 531.4717 560.4481 619.4743 631.0200 659.5457 687.8288 711.1039 733.3927 763.4365 772.6397 807.5971 816.5779 844.5357 903.6433 915.3268 926.9137 931.1115 959.5765 965.7230 980.6172 995.4315 1005.5090 1014.0381 1031.2025 1037.4773 1080.2101 1094.5474 1120.1359 1135.3908 1159.4537 1173.7884 1182.5514 1189.5691 1240.7138 1262.0855 1266.2001 1296.4859 1310.6037 1334.1694 1351.7284 1381.2135 1382.8613 1398.9960 1400.8552 1439.9216 1447.2770 1449.1286 1453.3284 1462.0076 1471.3823 1472.5031 1480.0630 1485.7808 1534.2708 1549.5695 1585.7113 1606.8959 1617.1044 1703.2527 2966.8570 2973.7885 2977.4985 3006.4128 3009.1061 3062.5848 3069.3934 3071.9206 3078.3003 3088.4101 3100.8576 3139.2143 3143.8601 3153.4996 3163.9563 3173.6855
redmass: 3.0719 4.8747 4.3163 5.0954 4.2310 3.4834 1.1279 6.0149 4.8123 7.4577 6.3794 2.5757 1.1273 5.4019 1.0607 4.2137 4.9700 7.4524 2.3349 6.9441 3.6189 2.4537 4.4662 3.8812 5.4350 6.2671 4.5920 3.3672 5.3376 4.5996 6.2186 5.6360 5.6173 4.8779 2.6098 5.3874 3.2032 1.9801 3.1169 3.8725 1.7605 2.9767 1.5455 1.8250 2.0715 1.8024 2.3060 1.3977 3.5335 1.3632 2.1173 1.6677 2.1153 1.7555 2.1157 3.0331 2.7206 1.1296 2.2051 2.4341 1.4744 1.4735 1.4230 4.0994 2.4516 1.5768 1.4688 1.2096 1.2368 1.2159 9.9185 2.0542 1.2595 1.0642 1.0507 1.0511 2.4898 1.0717 1.0692 1.0554 8.5821 10.3267 8.2128 6.6898 9.2892 10.7915 1.0816 1.0368 1.0361 1.0591 1.0372 1.0993 1.1028 1.0996 1.0996 1.0993 1.0958 1.0864 1.1020 1.0902 1.0948 1.1005
irintensity: 0.4893 6.1361 1.3250 1.1048 1.9067 0.7414 0.4802 1.0797 1.1540 0.7537 0.7559 0.2648 0.0987 0.4931 0.0410 2.3782 1.5433 2.3203 0.5091 13.8429 0.1423 6.1531 2.0917 1.4206 7.0951 0.7510 1.7337 15.8416 16.8332 18.1200 16.7611 2.0749 3.0712 18.7172 72.0850 54.7658 6.0703 27.0096 30.8143 6.1649 4.1477 71.2978 0.3855 18.0786 27.5070 21.2310 144.4727 2.9764 53.2414 0.0562 7.6995 11.1849 18.7125 8.3456 236.8055 390.3778 27.3670 3.1223 9.0617 32.0627 7.7826 89.7093 13.1860 183.3397 41.7306 8.7658 17.0794 8.4551 83.0517 14.5015 0.1960 1.3786 5.2402 24.7966 20.1325 5.0761 0.3663 4.3142 44.3079 12.6014 34.8918 222.1413 55.3234 1.1949 61.3887 176.9191 28.0863 25.6525 24.3282 23.9481 0.4345 25.0892 6.5184 85.9955 45.1158 24.5448 5.7721 3.6225 10.4207 4.8267 1.3761 25.1399
temp: 298.150 k
press: 1.00000 atm
elementType: 8 8 8 8 6 6 6 6 6 6 6 6 6 6 6 6 6 6 6 6 1 1 1 1 1 1 1 1 1 1 1 1 1 1 1 1
symmnumber: 1
zpe: 737151.9 jmol-1
zpe.correction: 0.280766 hartree
zpe.thermalcorrener: 0.300049 hartree
zpe.thermalcorrenthalpy: 0.300993 hartree
zpe.thermalcorrgfe: 0.232399 hartree
zpe.sumelectzpe: -918.756404 hartree
zpe.sumelectthermal: -918.737121 hartree
zpe.sumelectthermalent: -918.736177 hartree
zpe.sumelectthermalfe: -918.804771 hartree
dipole: 0.2365 0.4161 -1.7928
dipole: 1.8556
quadrupole: -88.4855 -123.4478 -123.7771
quadrupole: -1.5206 -1.3431 2.1631
quadrupole: 23.4180 -11.5443 -11.8737 -1.5206 -1.3431 2.1631
hfenergy: -919.0371702 hartree
pointgroup: C01 [X(C16H16O4)]
dipole: -0.1123812 -0.1382571 -0.707984 debye
polarizability: 242.1766672|4.3377318|220.0927851|-2.3446715|-19.6046335|116.8735432 unknown
InChI: InChI=1S/C16H16O4/c1-9(2)8-13-14(18)11-6-4-5-7-12(11)15(19)16(13)20-10(3)17/h4-7,9H,8H2,1-3H3
charge 0 multiplicity 1
36 atoms
O  2.118462 0.949609 -0.100122
O  -0.950387 -2.540077 1.170438
O  -0.040749 2.497014 -0.787714
O  1.867847 2.553184 1.601593
C  2.327394 -2.677899 -0.354761
C  1.794891 -1.797773 0.835306
C  0.648516 -0.875082 0.495023
C  -0.749937 -1.385143 0.673764
C  0.822511 0.42873 0.086515
C  3.030056 -1.837102 -1.44543
C  1.232413 -3.580135 -0.970489
C  -1.900427 -0.499812 0.305345
C  -1.679266 0.823253 -0.168222
C  -0.29286 1.346007 -0.312962
C  -3.223013 -0.984853 0.435655
C  -2.77795 1.650401 -0.502187
C  -4.316174 -0.158723 0.098271
C  -4.093998 1.160313 -0.370195
C  2.464563 2.179028 0.583566
C  3.63425 2.818737 -0.113375
H  3.089408 -3.339776 0.108074
H  1.448918 -2.483003 1.630181
H  2.640239 -1.19953 1.220767
H  2.323036 -1.143181 -1.935883
H  3.451058 -2.498579 -2.225819
H  3.851716 -1.230809 -1.023469
H  0.686925 -4.144271 -0.19407
H  0.490269 -2.981571 -1.532333
H  1.683725 -4.299517 -1.678804
H  -3.368631 -2.005335 0.803249
H  -2.577256 2.665577 -0.858569
H  -5.338781 -0.537142 0.19976
H  -4.944747 1.799563 -0.628415
H  3.263326 3.330808 -1.019592
H  4.362212 2.056758 -0.43567
H  4.11144 3.555832 0.548473
