program: Gaussian 09
title: 000231112
version: EM64L-G09RevD.01
frameworkgroup: C1[X(C17H16N2O3)]
method: RPBEPBE
basis: SDD
operation: Freq
keyword: #p
keyword: freq=noraman
keyword: PBEPBE/SDD
title: #p freq=noraman PBEPBE/SDD
converged: YES YES NO NO
title: Mulliken charges:
elementType: O O O N N C C C C C C C C C C C C C C C C C H H H H H H H H H H H H H H H H
charge: -0.208467 -0.261874 -0.256476 -0.418980 -0.101116 -0.365407 0.072528 0.573010 0.339886 0.035273 -0.436284 -0.385810 -0.343004 -0.370211 -0.359133 -0.348891 0.313768 -0.375121 -0.357621 0.325230 -0.538033 -0.536489 0.255877 0.320839 0.239320 0.249658 0.249554 0.288938 0.254013 0.244705 0.254535 0.246516 0.247969 0.223975 0.223756 0.226813 0.227365 0.249385
chargesum: 0.00000
title: Mulliken charges with hydrogens summed into heavy atoms:
elementType: O O O N N C C C C C C C C C C C C C C C C C
charge: -0.208467 -0.261874 -0.256476 -0.098140 -0.101116 -0.109530 0.072528 0.573010 0.339886 0.035273 -0.196963 -0.136151 -0.093450 -0.081273 -0.105120 -0.104186 0.313768 -0.120586 -0.111105 0.325230 0.157668 0.167074
polarizability: 2.63536927e+02 1.72126776e+01 2.52173695e+02 1.05510398e+01 -1.91093876e+01 1.57422181e+02
1716.lowfreq: -4.5557 -3.5295 0.0001 0.0005 0.0006 4.9558 22.8904 34.5593 39.1980
frequency: 22.8624 34.5412 39.1494 61.4274 70.2993 84.3792 106.4448 120.0373 154.8631 171.7182 181.8732 215.0153 227.5275 239.1551 242.4755 271.0946 287.9127 312.3697 364.8808 399.9422 413.5918 414.6974 455.3144 470.9747 483.1565 519.7345 525.7432 531.7852 574.7785 581.9725 617.7107 629.9796 637.3123 710.6098 719.3315 739.2263 742.5929 760.8621 774.7238 819.0348 820.5368 827.7799 836.6138 853.1351 881.0793 886.5699 949.4243 961.4598 963.8703 980.8211 985.8130 987.5778 993.3146 1001.9347 1017.1613 1072.3169 1111.5593 1111.6383 1113.2297 1116.7560 1137.8960 1155.6712 1157.8468 1176.5086 1180.9517 1202.8697 1227.1385 1235.3765 1241.5023 1275.9561 1301.6480 1312.8009 1317.2213 1351.4665 1373.3351 1388.1659 1422.2251 1429.4485 1436.2889 1438.0211 1466.5897 1468.7486 1470.8719 1471.6516 1492.6891 1501.3010 1532.7716 1573.6478 1584.5356 1619.6168 1621.9807 1685.4678 2959.9383 2962.8216 2968.5069 3052.1547 3060.3310 3115.2393 3127.9668 3130.9297 3132.1009 3151.5282 3153.3440 3163.7329 3168.1102 3170.0364 3175.2880 3608.9219
redmass: 4.5447 3.6516 4.0881 5.0741 5.6301 4.2509 4.7719 4.3676 4.1402 4.8706 4.1216 1.5342 1.2442 2.4481 5.6854 3.5968 5.6216 5.0364 5.7502 6.3426 2.9492 3.0277 4.5560 4.0837 3.8598 2.6243 1.3719 2.7645 3.7554 5.8074 5.5391 6.7643 5.3651 8.6789 7.4277 4.7044 3.9132 5.3352 6.0239 1.3918 1.3103 2.2009 1.6218 2.5050 6.6979 6.9740 1.3816 1.3701 1.3638 7.8195 7.8718 1.3869 3.9221 2.7258 2.7447 2.3922 1.2590 1.2609 1.3602 1.3452 4.1510 1.3443 1.3314 1.2311 1.2435 2.0449 1.8126 3.5735 3.0281 1.5789 1.6388 1.6484 1.9149 1.8331 4.2191 4.1987 3.1098 3.0888 1.1811 1.3356 1.0501 1.0504 1.1025 1.0753 2.7379 2.4418 6.3609 7.3884 7.0082 6.2629 6.2990 10.0208 1.0826 1.0329 1.0325 1.1041 1.1044 1.0900 1.0987 1.0903 1.1001 1.0879 1.0878 1.0940 1.0948 1.0960 1.0972 1.0801
irintensity: 0.8101 0.5552 0.7531 0.3602 7.2453 1.0632 9.5219 2.8520 0.4323 7.1980 0.8627 0.4221 0.4343 1.8619 0.2150 1.1384 0.5421 0.4573 0.6782 15.5835 0.3395 1.7470 2.7923 3.1917 8.0801 48.5324 57.1959 95.9956 21.2768 14.8427 9.0812 0.8746 4.5724 2.3364 12.5196 1.2054 4.3094 7.0222 10.4586 7.0176 4.5830 16.1119 49.9198 72.7250 70.1579 10.7106 0.0197 0.8716 0.2866 80.5549 40.9738 0.6750 11.7782 7.6916 2.1541 58.7837 0.1400 0.6742 22.2537 13.4625 234.8447 0.2297 1.8774 182.3853 67.1565 3.9905 121.7543 198.9001 130.8149 62.1806 16.4514 42.8298 37.9833 10.0935 85.9246 9.6788 0.6852 12.9198 10.0168 10.0618 14.1420 16.1243 115.6012 60.7992 251.5213 113.3945 166.1890 63.2956 17.5627 227.3166 75.1443 470.9802 27.5386 59.1768 73.3931 43.7215 41.0054 13.0273 29.5165 1.9968 22.7138 3.3788 2.9755 9.9641 4.8535 10.7368 6.1058 44.5705
temp: 298.150 k
press: 1.00000 atm
elementType: 8 8 8 7 7 6 6 6 6 6 6 6 6 6 6 6 6 6 6 6 6 6 1 1 1 1 1 1 1 1 1 1 1 1 1 1 1 1
symmnumber: 1
zpe: 774922.1 jmol-1
zpe.correction: 0.295152 hartree
zpe.thermalcorrener: 0.314795 hartree
zpe.thermalcorrenthalpy: 0.315739 hartree
zpe.thermalcorrgfe: 0.245336 hartree
zpe.sumelectzpe: -991.000090 hartree
zpe.sumelectthermal: -990.980447 hartree
zpe.sumelectthermalent: -990.979503 hartree
zpe.sumelectthermalfe: -991.049906 hartree
dipole: -0.5452 -6.6200 0.4063
dipole: 6.6548
quadrupole: -94.2939 -158.5322 -118.9031
quadrupole: 1.7631 0.8299 17.1601
quadrupole: 29.6158 -34.6225 5.0067 1.7631 0.8299 17.1601
hfenergy: -991.2952424 hartree
pointgroup: C01 [X(C17H16N2O3)]
dipole: -0.3204841 2.5892302 -0.2194997 debye
polarizability: 263.6985711|-18.0249872|249.7346596|-14.2049506|-21.3180068|159.6995736 unknown
InChI: InChI=1S/C17H16N2O3/c1-21-13-7-3-11(4-8-13)15-16(19-17(20)18-15)12-5-9-14(22-2)10-6-12/h3-10,15,18H,1-2H3
charge 0 multiplicity 1
38 atoms
O  0.867096 -4.639668 1.001827
O  4.286889 2.916281 -0.081817
O  -4.675636 2.293222 0.035387
N  1.330377 -2.852873 -0.492244
N  -0.602241 -2.731606 0.762569
C  0.7366 -1.56098 -0.858318
C  -0.538064 -1.628199 0.02961
C  1.663326 -0.369508 -0.614014
C  -1.592258 -0.608918 0.039468
C  0.584259 -3.539428 0.47617
C  2.125375 0.414706 -1.702043
C  2.101105 -0.043331 0.690943
C  -1.52427 0.57349 -0.755003
C  -2.738546 -0.810194 0.858048
C  2.9961 1.499846 -1.495768
C  2.973491 1.041802 0.917781
C  3.422332 1.818578 -0.18183
C  -2.563232 1.514783 -0.731958
C  -3.786421 0.12525 0.891264
C  -3.700129 1.296013 0.089815
C  4.766025 3.286125 1.253478
C  -5.880155 2.12474 0.857821
H  0.42891 -1.55481 -1.925829
H  2.239053 -3.174402 -0.819537
H  1.805472 0.17046 -2.723298
H  1.758927 -0.643095 1.542758
H  -0.648224 0.766775 -1.381094
H  -2.783608 -1.721879 1.462132
H  3.361103 2.109078 -2.327901
H  3.292097 1.271431 1.938808
H  -2.522042 2.426601 -1.33477
H  -4.654772 -0.059815 1.530113
H  5.420584 4.154787 1.091711
H  5.345346 2.463108 1.714925
H  3.926956 3.569787 1.917831
H  -5.626984 2.084544 1.934369
H  -6.436441 1.212647 0.569205
H  -6.491699 3.014852 0.651989
