program: Gaussian 09
title: 000231104
version: EM64L-G09RevD.01
frameworkgroup: C1[X(C18H23NO4)]
method: RPBEPBE
basis: SDD
operation: Freq
keyword: #p
keyword: freq=noraman
keyword: PBEPBE/SDD
title: #p freq=noraman PBEPBE/SDD
converged: YES YES NO NO
title: Mulliken charges:
elementType: O O O O N C C C C C C C C C C C C C C C C C C H H H H H H H H H H H H H H H H H H H H H H H
charge: -0.245037 -0.245707 -0.238426 -0.239735 -0.567745 -0.298613 -0.615983 0.548159 0.542875 -0.529509 -0.490351 -0.510864 -0.473888 0.193653 0.193013 -0.342847 0.180947 -0.338462 0.183327 -0.547511 -0.548135 -0.539255 -0.539079 0.236727 0.206454 0.238543 0.266263 0.225726 0.270180 0.273944 0.267624 0.236969 0.238219 0.238913 0.216930 0.243415 0.244650 0.216347 0.243345 0.244298 0.218892 0.246190 0.215196 0.215206 0.219551 0.245594
chargesum: 0.00000
title: Mulliken charges with hydrogens summed into heavy atoms:
elementType: O O O O N C C C C C C C C C C C C C C C C C C
charge: -0.245037 -0.245707 -0.238426 -0.239735 -0.023621 -0.061885 -0.170986 0.548159 0.542875 -0.263246 -0.264625 -0.243241 -0.236920 0.193653 0.193013 -0.104629 0.180947 -0.099549 0.183327 0.157484 0.155855 0.141023 0.141272
polarizability: 2.55694713e+02 -7.36354469e-01 2.47654442e+02 4.11190455e+01 -4.05228546e-01 1.57530943e+02
1716.lowfreq: -6.8591 -1.7900 -0.0004 0.0002 0.0006 6.6448 13.8573 17.3587 23.8463
frequency: 12.8540 17.2918 23.8096 57.7540 62.7563 83.7755 89.9189 102.8658 110.6121 142.3346 147.6198 156.8924 177.9476 179.7945 202.4371 215.3640 230.8870 246.4188 253.0835 260.3575 267.7664 277.0393 293.4971 308.5086 343.0746 354.6513 364.9339 373.0070 399.3002 437.3012 461.3420 465.0487 470.9372 485.5283 553.9358 557.8544 578.6194 590.7060 616.4508 634.7472 646.2936 711.1156 720.8825 730.2355 732.3046 740.0957 745.0219 797.5975 803.6066 857.2144 864.4443 878.8577 903.9027 914.5971 919.4411 948.5050 966.0823 985.4066 985.6302 996.5344 1003.5449 1096.5255 1110.4941 1111.0573 1111.5804 1114.1318 1114.4133 1131.3371 1137.2051 1143.1911 1146.3707 1156.5750 1157.8235 1173.1499 1177.7864 1193.6430 1213.8803 1223.2011 1253.2142 1262.8382 1276.2475 1283.9513 1295.0135 1310.7424 1334.7018 1394.0856 1401.4149 1405.8861 1410.9366 1435.0148 1436.2002 1442.9113 1445.4331 1465.3306 1465.7149 1466.8496 1468.4515 1468.8480 1472.3288 1472.7961 1473.8063 1474.3973 1505.3461 1507.4554 1589.0668 1589.5022 1607.5530 1610.9940 1637.7054 2952.5466 2953.0027 2957.4422 2958.5569 2973.7558 2987.9475 3038.1734 3038.4579 3045.6882 3047.2376 3047.5168 3122.0864 3122.6014 3123.8590 3124.3395 3125.2269 3127.4676 3151.9261 3157.6612 3157.8202 3161.4325 3433.8534 3559.9456
redmass: 3.8942 5.0508 4.8155 4.2012 3.9283 3.1686 3.3986 3.3353 3.6298 3.8237 4.2601 3.1205 3.3419 3.6106 1.9133 1.5900 1.5482 1.1887 1.5763 1.2728 2.1891 1.9623 2.5442 2.9767 3.9399 2.8487 3.6226 4.5959 4.1853 4.0176 3.5331 3.9369 3.9101 5.6998 4.6470 3.4025 3.8966 2.6258 4.7669 2.2853 3.4637 3.5450 4.8684 5.1767 4.3470 3.4367 3.6553 1.4621 1.4954 2.7643 1.6008 1.7749 2.4756 1.4809 1.5078 2.8984 2.3238 8.1755 7.6265 4.4129 3.6777 2.2682 1.8341 1.2656 1.2670 1.2621 1.2811 2.1372 1.9363 1.5038 1.4873 1.4067 1.4212 1.5389 1.6135 1.3136 2.2066 2.0310 3.9810 3.2057 1.4379 1.5249 1.4281 1.6320 1.4599 5.4234 3.7626 2.7708 2.4482 1.1856 1.1792 1.3040 1.3363 1.0537 1.0554 1.0507 1.0629 1.0863 1.0698 1.0778 1.0624 1.0999 2.5162 2.6520 6.9025 7.1571 6.6913 6.5246 1.0931 1.0332 1.0333 1.0331 1.0330 1.0668 1.0791 1.1035 1.1035 1.1040 1.1005 1.1040 1.0985 1.0949 1.0992 1.0920 1.0988 1.0891 1.0897 1.0928 1.0921 1.0931 1.0447 1.0967
irintensity: 0.0520 0.0344 0.0102 1.6346 0.3837 25.9727 1.4518 0.0533 0.6784 0.0923 0.0194 0.8081 4.0250 8.5780 0.0080 0.5500 1.6339 1.8440 11.1245 9.5636 19.9090 3.2264 9.1443 0.9659 0.8996 5.7870 1.4725 0.5317 16.9531 2.3309 2.2724 9.2527 4.4591 6.3091 27.0651 14.0623 4.6248 70.6286 27.8212 182.8502 54.3006 46.1745 6.6745 18.7881 5.8645 0.1988 6.7373 6.0630 64.9839 2.4999 8.9561 45.9367 3.1102 0.6385 0.2325 2.9713 5.6893 7.6709 57.9969 37.1335 38.7952 37.6984 36.5015 0.6328 0.6782 0.6484 2.0600 219.8315 1.8799 0.1353 13.4693 3.6000 11.4898 13.2860 25.2070 9.2946 91.3042 93.1464 110.8670 176.8483 23.2284 36.1218 5.7290 2.9847 1.3953 5.9738 8.9323 23.5047 21.1162 12.7405 12.9383 11.0086 4.4407 15.0630 3.3162 10.1655 11.3013 22.2408 66.1068 83.6398 30.0925 3.8776 107.9543 136.9558 43.9958 20.3426 12.7608 18.1703 32.2997 110.1031 66.3297 36.1290 43.9715 13.2284 41.6448 46.6528 56.4651 73.4910 23.7775 15.3832 24.4126 31.9720 22.9554 3.2656 24.5937 5.4763 14.8318 30.7252 4.3416 1.8338 3.2911 0.3631
temp: 298.150 k
press: 1.00000 atm
elementType: 8 8 8 8 7 6 6 6 6 6 6 6 6 6 6 6 6 6 6 6 6 6 6 1 1 1 1 1 1 1 1 1 1 1 1 1 1 1 1 1 1 1 1 1 1 1
symmnumber: 1
zpe: 986955.0 jmol-1
zpe.correction: 0.375911 hartree
zpe.thermalcorrener: 0.400000 hartree
zpe.thermalcorrenthalpy: 0.400944 hartree
zpe.thermalcorrgfe: 0.320624 hartree
zpe.sumelectzpe: -1053.556972 hartree
zpe.sumelectthermal: -1053.532884 hartree
zpe.sumelectthermalent: -1053.531939 hartree
zpe.sumelectthermalfe: -1053.612260 hartree
dipole: -0.9914 0.7323 -0.3358
dipole: 1.2774
quadrupole: -112.6246 -142.1430 -128.8898
quadrupole: -1.7025 19.5026 -0.5455
quadrupole: 15.2612 -14.2572 -1.0040 -1.7025 19.5026 -0.5455
hfenergy: -1053.9328831 hartree
pointgroup: C01 [X(C18H23N1O4)]
dipole: 0.2949833 0.4009681 0.069296 debye
polarizability: 209.2969506|34.6592785|236.7399149|53.7197731|-19.0879144|214.8432333 unknown
InChI: InChI=1S/C18H23NO4/c1-20-15-7-5-12(10-17(15)22-3)9-14(19)13-6-8-16(21-2)18(11-13)23-4/h5-8,10-11,14H,9,19H2,1-4H3
charge 0 multiplicity 1
46 atoms
O  2.173839 -2.009852 0.477998
O  -2.3544 -1.438541 1.471645
O  3.603573 -0.732299 2.312249
O  -3.835318 -2.286062 -0.557641
N  1.243134 3.61592 -2.081978
C  0.678651 2.316444 -1.65463
C  -0.782063 2.583297 -1.14433
C  1.512916 1.547079 -0.614065
C  -1.630886 1.331502 -0.996413
C  1.492612 0.127112 -0.604794
C  2.268065 2.215347 0.371668
C  -1.620274 0.57928 0.20921
C  -2.41361 0.86237 -2.073073
C  2.179755 -0.613028 0.379818
C  -2.346817 -0.623347 0.332392
C  2.979744 1.48831 1.357329
C  2.942658 0.077253 1.377322
C  -3.16447 -0.33335 -1.96109
C  -3.138481 -1.087458 -0.76795
C  1.361284 -2.745117 -0.496859
C  -1.516292 -1.020799 2.599964
C  4.409822 -0.051757 3.325664
C  -4.676282 -2.76567 -1.654668
H  0.590088 1.682658 -2.559449
H  -0.714149 3.125536 -0.179406
H  -1.240473 3.268704 -1.881396
H  0.904267 -0.394856 -1.366137
H  2.315205 3.310363 0.377571
H  2.214955 3.553979 -2.406108
H  1.130512 4.361896 -1.385481
H  -1.010041 0.934683 1.044782
H  -2.44473 1.432227 -3.009146
H  3.562986 2.031238 2.107577
H  -3.769222 -0.668671 -2.809148
H  1.728384 -2.584503 -1.529548
H  0.293778 -2.457949 -0.432006
H  1.479307 -3.803307 -0.221411
H  -1.844078 -0.043513 3.005668
H  -0.448158 -0.965273 2.312579
H  -1.6562 -1.80351 3.359923
H  5.224675 0.540872 2.86462
H  4.838762 -0.859292 3.936944
H  3.788734 0.609052 3.962816
H  -4.077229 -2.983507 -2.561322
H  -5.470863 -2.035194 -1.905062
H  -5.130767 -3.694269 -1.279132
