program: Gaussian 09
title: 000231100
version: EM64L-G09RevD.01
frameworkgroup: C1[X(C18H20O5)]
method: RPBEPBE
basis: SDD
operation: Freq
keyword: #pfreq=noraman
keyword: PBEPBE/SDD
title: #p freq=noraman PBEPBE/SDD
converged: YES YES NO NO
title: Mulliken charges:
elementType: O O O O O C C C C C C C C C C C C C C C C C C H H H H H H H H H H H H H H H H H H H H
charge: -0.320684 -0.311898 -0.304987 -0.224574 -0.307257 -0.602020 0.389697 0.097144 0.246989 0.060688 -0.402164 0.079007 0.213515 -0.379925 0.221893 -0.223809 -0.373294 -0.218869 -0.356673 -0.531293 -0.535384 -0.524781 -0.532869 0.259436 0.245386 0.249854 0.284430 0.227727 0.250316 0.234534 0.254733 0.224576 0.223716 0.256597 0.256399 0.222469 0.248773 0.215347 0.248110 0.228769 0.254749 0.225767 0.229862
chargesum: 0.00000
title: Mulliken charges with hydrogens summed into heavy atoms:
elementType: O O O O O C C C C C C C C C C C C C C C C C C
charge: -0.320684 -0.311898 -0.304987 -0.224574 -0.307257 -0.097198 0.389697 0.097144 0.246989 0.060688 -0.152309 0.079007 0.213515 -0.095495 0.221893 0.003918 -0.122978 0.015665 -0.101940 0.173596 0.192257 0.167445 0.177509
polarizability: 2.29230217e+02 2.70157860e+01 2.19334896e+02 -1.84033220e+01 -1.93368161e+00 1.79737675e+02
1716.lowfreq: -3.6383 -2.8697 -2.3042 0.0006 0.0009 0.0011 15.4915 25.0158 35.2742
frequency: 15.0751 24.5654 35.2679 67.3628 75.0024 76.7409 85.1607 94.0488 95.9989 109.0209 141.2955 154.2444 160.0832 162.0585 163.7132 173.5893 175.6427 202.3836 217.2101 254.9420 264.2753 280.0491 338.9217 343.7975 348.7212 366.5402 374.3483 388.4692 443.9356 459.7440 476.1163 521.9902 538.9664 547.6460 565.2620 573.3706 594.3508 600.3804 616.0807 653.8956 732.1601 756.5296 764.2559 776.5956 778.8294 804.8113 826.0229 844.5280 885.7236 902.2556 931.0038 938.9234 945.0615 949.9479 964.2970 972.3515 991.9688 999.8768 1060.2396 1069.2462 1078.9414 1112.7311 1113.8895 1114.0644 1115.2788 1138.9080 1149.1858 1152.8474 1153.6057 1161.2669 1167.2565 1172.2749 1175.9381 1199.4180 1231.1485 1235.5241 1263.3940 1269.3239 1289.1350 1363.4293 1364.6667 1403.7480 1414.0977 1424.6903 1426.9071 1431.9559 1440.7102 1444.3203 1450.1773 1455.6481 1458.8033 1459.1096 1461.9092 1463.7527 1475.6762 1476.8670 1484.8285 1486.9119 1552.8108 1576.4205 1588.0373 1593.9688 1597.4387 2964.2963 2970.9498 2971.4758 2978.2530 3005.5242 3060.2700 3066.2017 3069.6844 3077.8255 3078.4864 3115.5006 3116.5628 3120.0970 3128.4169 3133.2711 3141.5617 3147.0542 3158.7444 3167.7694 3171.7357
redmass: 5.4267 4.3000 4.5579 4.0687 5.0386 3.2748 3.1535 3.3201 3.7544 2.6179 2.4713 1.1702 1.2058 1.1899 1.2022 2.9073 3.0908 3.9696 4.0527 4.5257 5.0884 4.5578 4.1879 5.4092 4.8819 4.7917 4.1370 5.5846 5.1593 5.3886 5.9015 4.8839 4.7313 4.4773 3.9350 4.4689 4.6265 4.7368 5.5387 4.8054 5.1149 2.3250 1.9929 3.7589 5.5081 2.0557 2.6448 5.6215 4.0589 1.4471 1.6738 2.3728 9.2788 7.0718 6.5961 1.3762 1.3747 4.3537 2.2381 1.9680 2.5694 1.2430 1.2400 1.2396 1.2322 1.6633 1.3428 1.3572 1.3514 1.7493 1.4852 1.5442 1.5797 1.7759 2.3745 2.4965 2.3664 2.8270 1.5614 8.2155 7.6409 1.7390 1.3563 1.3448 1.2777 1.2511 1.5489 1.9634 1.8637 1.0588 1.0578 1.1293 2.0483 1.0937 1.0663 1.0611 1.0531 1.0537 8.5273 7.0950 7.0401 6.5722 7.2037 1.0318 1.0305 1.0304 1.0311 1.0613 1.1026 1.1048 1.1042 1.1015 1.0984 1.1031 1.1023 1.1024 1.0872 1.1035 1.0865 1.0918 1.0919 1.0985 1.0993
irintensity: 0.4445 0.0863 0.0483 1.2393 2.0964 1.4193 7.3638 3.5691 3.0388 6.9225 2.7261 0.1457 0.8220 0.2474 1.2600 0.6185 5.3778 5.7788 7.5847 9.4421 6.3691 18.4877 2.2506 0.4747 0.8568 0.2743 6.0492 1.5805 1.7255 4.7969 6.9975 15.9424 6.7697 0.8116 3.1833 2.7605 2.6516 15.3740 2.7725 18.8365 2.2220 34.6535 34.8576 22.5895 33.1251 24.1525 21.5704 9.4902 3.5950 0.3317 3.7026 3.5351 62.6111 53.6289 50.3133 1.8597 3.5446 71.5374 45.2054 16.1689 12.4609 8.2536 6.2944 3.9653 4.3934 24.6081 8.7511 0.5989 1.3394 26.4241 19.3914 2.9987 28.3701 43.9713 27.7579 132.6694 49.7080 182.5887 33.8903 35.3550 1.7992 29.6611 11.8763 3.3290 9.1666 57.8460 77.9113 44.4800 8.8556 15.0335 15.6183 2.2360 6.7813 2.5585 7.3652 7.8211 29.0063 9.7064 207.0438 5.4024 15.6233 8.8265 8.6679 70.5311 63.1923 62.1524 57.1779 14.1957 30.0253 26.0668 22.3400 22.1868 12.3982 21.3395 30.8963 23.8825 3.7820 9.4948 6.3682 10.3057 0.7179 13.9279 18.8367
temp: 298.150 k
press: 1.00000 atm
elementType: 8 8 8 8 8 6 6 6 6 6 6 6 6 6 6 6 6 6 6 6 6 6 6 1 1 1 1 1 1 1 1 1 1 1 1 1 1 1 1 1 1 1 1
symmnumber: 1
zpe: 890677.2 jmol-1
zpe.correction: 0.339241 hartree
zpe.thermalcorrener: 0.363028 hartree
zpe.thermalcorrenthalpy: 0.363973 hartree
zpe.thermalcorrgfe: 0.284418 hartree
zpe.sumelectzpe: -1072.253999 hartree
zpe.sumelectthermal: -1072.230212 hartree
zpe.sumelectthermalent: -1072.229268 hartree
zpe.sumelectthermalfe: -1072.308822 hartree
dipole: 1.2163 3.9558 -0.0597
dipole: 4.1390
quadrupole: -133.4631 -138.2595 -123.8176
quadrupole: -0.4867 -10.9122 -2.5271
quadrupole: -1.6164 -6.4128 8.0292 -0.4867 -10.9122 -2.5271
hfenergy: -1072.5932401 hartree
pointgroup: C01 [X(C18H20O5)]
dipole: -0.1280721 1.5837795 0.356246 debye
polarizability: 207.3590786|26.0832456|240.5586855|-12.419827|3.8902313|180.3850237 unknown
InChI: InChI=1S/C18H20O5/c1-20-15-9-5-7-12(17(15)22-3)11-14(19)13-8-6-10-16(21-2)18(13)23-4/h5-10H,11H2,1-4H3
charge 0 multiplicity 1
43 atoms
O  1.972206 1.142318 -1.458264
O  -0.967548 0.621381 -0.873698
O  3.262951 2.101524 0.934706
O  -0.485652 -3.524616 -1.676715
O  -3.318226 1.46962 0.533439
C  0.806289 -1.487168 -1.594571
C  1.489017 -0.977046 -0.330195
C  -0.461308 -2.304076 -1.328621
C  -1.668252 -1.716338 -0.635374
C  2.062976 0.320532 -0.303114
C  1.607124 -1.794507 0.822417
C  -1.905172 -0.324726 -0.427524
C  2.690262 0.805484 0.878945
C  -2.650867 -2.644662 -0.184921
C  -3.072021 0.098634 0.278244
C  2.273045 -1.3316 1.978142
C  2.809698 -0.02596 2.01179
C  -3.826154 -2.217342 0.456193
C  -4.033969 -0.839235 0.699052
C  3.280119 1.408335 -2.104501
C  -1.444194 1.603317 -1.877805
C  2.289642 3.208759 0.808708
C  -2.348783 2.104514 1.458625
H  0.57726 -0.617521 -2.232791
H  1.483427 -2.1630 -2.1503
H  1.182964 -2.805103 0.804267
H  -2.45757 -3.705627 -0.371755
H  2.366646 -1.981879 2.854399
H  3.31729 0.368721 2.897679
H  -4.572225 -2.94839 0.783859
H  -4.924174 -0.472024 1.219968
H  3.059344 2.062524 -2.962272
H  3.730374 0.461944 -2.459174
H  3.96694 1.91173 -1.400672
H  -2.253971 2.22887 -1.463965
H  -1.801765 1.074917 -2.781518
H  -0.552385 2.201101 -2.116154
H  1.579755 3.189976 1.65851
H  1.736499 3.139765 -0.145433
H  2.888364 4.131976 0.843145
H  -1.318518 2.028376 1.065774
H  -2.40688 1.625924 2.454365
H  -2.660356 3.157779 1.529512
