program: Gaussian 09
title: 000231093
version: EM64L-G09RevD.01
frameworkgroup: C1[X(C15H14O2)]
method: RPBEPBE
basis: SDD
operation: Freq
keyword: #pfreq=noraman
keyword: PBEPBE/SDD
title: #p freq=noraman PBEPBE/SDD
converged: YES YES NO NO
title: Mulliken charges:
elementType: O O C C C C C C C C C C C C C C C H H H H H H H H H H H H H H
charge: -0.208356 -0.258277 -0.710208 0.522953 0.303050 0.113567 -0.311696 -0.355501 -0.395604 -0.396683 0.334534 -0.376854 -0.355182 -0.231553 -0.231508 -0.240756 -0.536827 0.240544 0.240143 0.250050 0.277332 0.227187 0.227002 0.254064 0.245629 0.222399 0.222431 0.225588 0.226640 0.226706 0.249184
chargesum: 0.00000
title: Mulliken charges with hydrogens summed into heavy atoms:
elementType: O O C C C C C C C C C C C C C C C
charge: -0.208356 -0.258277 -0.229521 0.522953 0.303050 0.113567 -0.061647 -0.078169 -0.168417 -0.169681 0.334534 -0.122790 -0.109553 -0.009154 -0.009076 -0.015168 0.165704
polarizability: 2.76245925e+02 1.45815093e+01 1.26007831e+02 -1.80845269e-01 -6.86001472e-02 1.16185650e+02
1716.lowfreq: -16.9046 -9.3040 -5.8425 -0.0003 0.0005 0.0008 5.3310 16.0062 53.6923
frequency: -16.6780 13.9298 53.6860 58.6046 75.9909 130.4630 134.0389 194.9000 210.2030 241.3901 289.2783 308.3037 327.2466 386.5822 401.9832 414.6375 474.8197 485.8494 499.2035 546.1001 568.7779 602.0753 617.4311 627.3363 699.5963 713.3165 734.5256 767.1820 798.1529 824.2267 832.6299 834.5446 848.4308 920.4599 923.1974 969.4804 971.1568 975.8593 982.6533 987.6159 990.4524 992.3571 1004.2997 1027.3581 1080.6500 1110.0972 1115.1237 1155.8048 1169.4862 1172.5383 1174.5778 1188.0580 1215.3930 1228.3737 1240.5411 1295.5647 1307.4005 1326.7320 1373.1427 1385.3845 1427.2174 1434.9150 1441.1260 1447.7445 1466.8508 1470.1760 1485.7598 1499.2390 1564.2035 1590.3162 1597.1437 1617.8348 1623.9568 2967.4287 2977.0194 3029.9145 3059.0269 3116.1033 3116.9949 3131.3775 3131.9390 3144.0769 3147.3361 3148.2131 3162.1582 3167.5657 3172.5501
redmass: 4.2525 4.5799 5.1552 3.5897 4.3271 4.4781 5.8933 4.1514 1.1648 4.4649 4.1920 5.7201 2.0123 6.4751 2.7964 2.9551 3.7038 3.3263 4.1102 5.7784 2.4739 5.6263 6.3918 7.0732 2.4423 1.8914 3.5923 3.4241 4.6389 1.2562 3.3834 1.6236 1.2528 1.5412 2.0713 1.4178 1.3936 5.5384 8.3834 1.3697 2.6178 1.8495 2.4042 2.1561 1.5976 1.2600 1.3366 1.3461 1.0932 1.2620 1.0875 1.1258 1.8451 3.0200 3.3101 1.8209 1.4504 1.2656 5.2107 8.3458 3.6285 1.2432 2.1903 1.1424 1.0500 1.0679 2.4076 2.4115 7.5724 7.4929 6.1334 6.2543 6.8474 1.0326 1.0601 1.0987 1.1044 1.0857 1.0879 1.1000 1.0913 1.0961 1.0880 1.0875 1.1016 1.0954 1.0969
irintensity: 0.0974 0.6814 0.8994 4.7058 0.0250 6.5652 3.9427 1.1115 0.0117 5.0389 1.4793 1.9237 1.3872 0.5652 0.0183 0.0855 6.9444 3.6862 5.8620 44.7311 17.7933 4.0526 0.3986 3.8098 19.4369 74.1323 0.0946 6.1691 4.6682 1.4660 15.6131 78.6637 0.1760 6.3514 0.8227 0.1826 0.0640 112.2894 15.7944 1.1278 0.3974 0.0045 2.0374 12.6946 9.3019 0.1952 13.6965 0.3657 0.5879 248.7110 1.7499 0.0548 79.8273 47.8294 216.4411 89.8927 76.1880 0.0909 44.2820 0.0111 0.2438 11.9852 6.6887 16.3356 14.6471 52.5001 15.5232 30.6576 55.0462 203.7567 1.1343 83.3326 65.1546 67.9290 35.9300 6.8339 42.2104 10.7718 4.5281 23.3489 14.4958 47.6594 0.2757 10.4160 27.2968 16.3895 4.9576
temp: 298.150 k
press: 1.00000 atm
elementType: 8 8 6 6 6 6 6 6 6 6 6 6 6 6 6 6 6 1 1 1 1 1 1 1 1 1 1 1 1 1 1
symmnumber: 1
zpe: 646805.2 jmol-1
zpe.correction: 0.246355 hartree
zpe.thermalcorrener: 0.260706 hartree
zpe.thermalcorrenthalpy: 0.261650 hartree
zpe.thermalcorrgfe: 0.203184 hartree
zpe.sumelectzpe: -729.224688 hartree
zpe.sumelectthermal: -729.210337 hartree
zpe.sumelectthermalent: -729.209393 hartree
zpe.sumelectthermalfe: -729.267859 hartree
dipole: -3.6240 -1.0961 0.0184
dipole: 3.7862
quadrupole: -75.1941 -101.3685 -96.1656
quadrupole: -10.3331 -0.1973 0.0194
quadrupole: 15.7153 -10.4591 -5.2562 -10.3331 -0.1973 0.0194
hfenergy: -729.4710429 hartree
pointgroup: C01 [X(C15H14O2)]
dipole: 1.4283114 0.4228905 -0.0007162 debye
polarizability: 276.4126454|13.6953302|125.8404554|-0.1234557|-0.1064816|116.1863054 unknown
InChI: InChI=1S/C15H14O2/c1-17-14-9-7-13(8-10-14)15(16)11-12-5-3-2-4-6-12/h2-10H,11H2,1H3
charge 0 multiplicity 1
31 atoms
O  -0.771049 -1.587016 0.020815
O  5.326189 0.560881 -0.008802
C  -1.280736 0.81558 -0.034197
C  -2.754022 0.456105 -0.013787
C  1.147256 -0.133001 -0.007945
C  -0.32732 -0.402886 -0.005287
C  1.702681 1.179258 -0.042146
C  2.037071 -1.239874 0.026064
C  -3.463127 0.237066 -1.220896
C  -3.446631 0.316999 1.214604
C  3.963631 0.2550 -0.006932
C  3.091949 1.374913 -0.042126
C  3.432078 -1.062062 0.027235
C  -4.832328 -0.110319 -1.203151
C  -4.815722 -0.030294 1.238699
C  -5.514398 -0.244233 0.028178
C  6.281596 -0.552905 0.03061
H  -1.038335 1.408655 -0.938651
H  -1.027398 1.459778 0.831235
H  1.05057 2.057957 -0.069237
H  1.600869 -2.244217 0.052038
H  -2.939465 0.33303 -2.180238
H  -2.90993 0.475822 2.158325
H  3.530229 2.37693 -0.068319
H  4.089035 -1.936276 0.05454
H  -5.365334 -0.276513 -2.146247
H  -5.335666 -0.133918 2.197895
H  -6.576693 -0.513043 0.044131
H  6.172134 -1.205634 -0.856335
H  6.15984 -1.151534 0.953372
H  7.272923 -0.077653 0.023054
