program: Gaussian 09
title: 000231086
version: EM64L-G09RevD.01
frameworkgroup: C1[X(C12H9NO3)]
method: RPBEPBE
basis: SDD
operation: Freq
keyword: #p
keyword: freq=noraman
keyword: PBEPBE/SDD
title: #p freq=noraman PBEPBE/SDD
converged: YES YES NO NO
title: Mulliken charges:
elementType: O O O N C C C C C C C C C C C C H H H H H H H H H
charge: -0.222474 -0.200434 -0.232364 -0.424367 0.345194 0.264169 0.369041 -0.199153 0.009444 -0.479919 -0.362316 -0.364468 -0.228822 -0.219929 0.221909 -0.788025 0.334035 0.287017 0.293657 0.354474 0.242714 0.242777 0.269130 0.244137 0.244574
chargesum: 0.00000
title: Mulliken charges with hydrogens summed into heavy atoms:
elementType: O O O N C C C C C C C C C C C C
charge: -0.222474 -0.200434 -0.232364 -0.069894 0.345194 0.264169 0.369041 -0.199153 0.009444 -0.145883 -0.075300 -0.070811 0.013892 0.022849 0.221909 -0.030184
polarizability: 2.33898123e+02 -1.09894617e+01 1.70638507e+02 5.75835418e-02 -1.25225414e-02 6.05137055e+01
1716.lowfreq: -50.1860 -0.0007 0.0003 0.0003 5.5621 10.5619 15.7028 46.3966 77.7714
frequency: -50.1337 46.3534 77.7707 114.5141 119.4019 129.5977 182.1044 227.2179 244.4243 267.4259 307.5171 372.5483 398.1517 441.9001 446.6768 452.3295 500.1982 519.1289 586.6173 591.0299 644.3387 673.0555 698.2797 717.0867 731.9800 795.9004 800.8792 816.5473 839.9737 904.6722 920.6068 944.9845 968.1918 995.8418 1004.3944 1015.2391 1036.3105 1036.4812 1073.3945 1115.5631 1172.8471 1200.3666 1221.9440 1233.9572 1268.3145 1312.6867 1328.0319 1381.9558 1400.4461 1442.8675 1446.5227 1465.3104 1469.5336 1490.5706 1530.0307 1549.5115 1585.1538 1608.3342 1620.7589 1640.0058 2992.7126 3077.5103 3139.0304 3140.4450 3152.9288 3163.2384 3173.2765 3196.1069 3400.8221
redmass: 1.0333 6.8818 4.4509 8.3807 5.1668 4.9030 5.8179 4.8563 7.2523 5.4786 5.5089 10.7364 3.5601 4.5812 5.7560 10.5699 3.8530 5.7991 2.9983 5.6859 6.4248 3.7463 6.5557 6.4463 3.1556 1.5691 4.9509 1.1649 3.0159 3.4726 1.3883 1.6870 3.1748 1.3965 2.8358 1.3662 2.1247 1.6883 2.9679 1.8180 1.0844 3.3485 1.7617 2.1064 1.7174 4.1488 3.2694 1.2460 9.4411 2.0267 1.3214 1.0460 2.8415 2.1040 8.1406 7.7324 7.0999 6.7267 5.3152 7.9883 1.0384 1.0980 1.0864 1.0985 1.0902 1.0948 1.1005 1.0929 1.0759
irintensity: 0.4718 1.2788 4.1840 9.9181 5.3825 0.8412 0.0684 0.6442 0.3359 0.8338 2.4279 25.1039 1.4057 0.7156 4.8467 4.2969 0.1048 34.9482 2.6353 1.0286 0.5382 3.8284 1.2419 0.4633 36.9345 54.0851 2.5136 81.2579 5.8199 8.4903 10.0024 28.7549 20.8984 2.7903 46.3896 0.1288 0.5363 10.1713 1.5619 23.3346 7.7917 6.7141 80.1042 92.9027 15.9393 390.1990 159.7562 70.0213 1.4244 69.6848 57.5548 20.3070 2.5503 737.8999 50.8579 207.9699 41.2127 3.6091 122.1991 95.3561 3.5664 10.7998 3.6063 7.2812 4.2485 1.4977 24.8151 7.2962 72.3160
temp: 298.150 k
press: 1.00000 atm
elementType: 8 8 8 7 6 6 6 6 6 6 6 6 6 6 6 6 1 1 1 1 1 1 1 1 1
symmnumber: 1
zpe: 481878.8 jmol-1
zpe.correction: 0.183538 hartree
zpe.thermalcorrener: 0.196224 hartree
zpe.thermalcorrenthalpy: 0.197168 hartree
zpe.thermalcorrgfe: 0.143891 hartree
zpe.sumelectzpe: -742.011330 hartree
zpe.sumelectthermal: -741.998644 hartree
zpe.sumelectthermalent: -741.997700 hartree
zpe.sumelectthermalfe: -742.050977 hartree
dipole: -1.1459 -4.6129 -0.0036
dipole: 4.7531
quadrupole: -68.8752 -105.7515 -93.0774
quadrupole: -6.8167 0.0282 0.0042
quadrupole: 20.3595 -16.5168 -3.8427 -6.8167 0.0282 0.0042
hfenergy: -742.1948678 hartree
pointgroup: C01 [X(C12H9N1O3)]
dipole: -0.484248 1.8061975 0.0120526 debye
dipolederiv: -0.798373 -0.1345814 -0.0125295 -0.3564602 -0.9052404 -0.0147526 -0.0152825 -0.0100052 -0.3169952 -0.691937 -0.1078501 -0.0100496 -0.1609722 -0.9192898 -0.0115243 -0.0105902 -0.0100331 -0.3191233 -0.7863289 -0.0319378 -0.0115375 0.5631095 -0.6978762 0.0095324 -0.0046368 -0.0051102 -0.3256803 -2.3327449 -0.2835838 -0.0525142 0.2273475 -0.4386832 0.0035618 -0.0475618 -0.0082373 -0.291215 -0.7619039 -0.1574502 -0.0192608 -0.1698376 -0.0446468 -0.0044125 -0.019568 -0.003989 0.0123139 -0.2723132 0.1931363 -0.0045191 0.4013383 -0.1765787 0.0064527 -0.0020061 0.0018476 0.0257404 1.0273079 0.601523 0.029285 1.0847201 -0.0524663 0.0238861 0.035415 0.0122694 0.1136437 1.3158847 -0.1180615 0.02469 0.2614119 1.067851 0.0164732 0.0292341 0.0078036 0.1511831 1.6740935 0.1558154 0.0371614 0.0130061 0.9286577 0.0105302 0.0351175 0.0132319 0.1508813 -0.9435642 -0.2566315 -0.0217463 -0.7130947 -0.1725344 -0.0171219 -0.0266721 -0.0060915 -0.1535546 -0.0346354 0.2057645 0.0038087 -0.0778264 0.0671466 0.000186 0.0005248 0.0065383 -0.0988315 -0.2399005 0.0097718 -0.0029537 0.1837275 0.0930479 0.0063949 -0.0007389 0.0025953 -0.1016937 0.0641272 -0.2151277 0.0020361 -0.122974 -0.0313193 -0.0013339 0.0031289 -0.0033814 -0.1470597 0.2335573 0.0710331 0.0088117 -0.0080129 0.0111843 0.0014982 0.0079228 0.0032052 -0.1299276 2.2472404 0.1612808 0.0519308 -0.7960048 0.8932176 -0.0115016 0.0406167 0.0113524 0.18991 -0.3644741 -0.1824393 -0.0119493 -0.31108 -0.1991103 -0.009689 -0.0111855 -0.0055337 0.0417111 0.0879238 0.0019189 -0.0020931 0.0300881 0.1072569 -0.0002178 -0.0019954 -0.0007696 0.1814179 0.1068973 -0.0632657 -0.001799 0.0011045 0.0054582 -0.001737 -0.0010515 -0.0032251 0.1552235 0.1358258 0.0190895 -0.0001888 -0.0580227 0.0108779 -0.0029977 -0.0012266 -0.0013531 0.1564754 0.3483167 0.034611 0.0014855 -0.1253131 0.2175573 -0.0039027 -0.0004071 -0.000226 0.2944782 -0.0271121 0.0920135 -0.0030341 0.1081362 0.008327 0.0005997 -0.0027913 0.000239 0.1597193 -0.1009252 -0.0448731 -0.0061757 -0.0514655 0.0825623 -0.0019943 -0.0062693 -0.0018439 0.1558193 -0.0365162 0.0364138 -0.0046237 0.1079805 0.0510712 0.002504 -0.0045818 0.0001474 0.1331351 0.0734076 0.0094788 0.0503322 -0.012762 0.0478515 -0.0937428 0.0072946 -0.1013193 -0.018669 0.0761465 0.0039516 -0.0445671 -0.0181439 0.045678 0.0933089 -0.0026897 0.1018883 -0.0189023 unknown
polarizability: 233.3786367|12.1001073|171.0439446|4.1189834|1.6098267|60.6277538 unknown
InChI: InChI=1S/C12H9NO3/c1-7(14)13-10-6-11(15)8-4-2-3-5-9(8)12(10)16/h2-6,13H,1H3
charge 0 multiplicity 1
25 atoms
O  0.457168 2.346156 0.055251
O  -0.822244 -2.985777 -0.038631
O  3.790028 -1.305779 0.09352
N  2.454679 0.615664 0.082549
C  -1.308193 0.683532 -0.004427
C  -1.628658 -0.705086 -0.027827
C  1.17644 0.054726 0.045144
C  0.106105 1.11933 0.032796
C  -0.538558 -1.741742 -0.016153
C  0.859138 -1.289504 0.021272
C  -2.342974 1.652154 -0.015868
C  -2.981948 -1.108388 -0.062355
C  -3.690879 1.240861 -0.050224
C  -4.010041 -0.140076 -0.073402
C  3.694571 -0.04791 0.106014
C  4.893386 0.891917 0.146225
H  1.640043 -2.052517 0.029867
H  -2.069604 2.711882 0.002751
H  -3.201041 -2.180613 -0.080035
H  2.436108 1.647417 0.094009
H  -4.491515 1.987625 -0.058922
H  -5.057983 -0.457289 -0.100089
H  5.81406 0.292111 0.168519
H  4.863604 1.537448 1.043301
H  4.914208 1.54806 -0.743388
