program: Gaussian 09
title: 000231069
version: EM64L-G09RevD.01
frameworkgroup: C1[X(C17H24N2O2)]
method: RPBEPBE
basis: SDD
operation: Freq
keyword: #p
keyword: freq=noraman
keyword: PBEPBE/SDD
title: #p freq=noraman PBEPBE/SDD
converged: YES YES NO NO
title: Mulliken charges:
elementType: O O N N C C C C C C C C C C C C C C C C C H H H H H H H H H H H H H H H H H H H H H H H H
charge: -0.200303 -0.200985 -0.104298 -0.216774 -0.354707 -0.392810 -0.379064 -0.363650 -0.370682 -0.323553 -0.323267 0.082522 0.083264 0.179410 0.179706 -0.676794 -0.672676 -0.354482 -0.354613 -0.211871 -0.211935 0.194221 0.193266 0.194581 0.219314 0.222680 0.224707 0.184665 0.200858 0.239158 0.238481 0.206223 0.185421 0.184880 0.202377 0.228005 0.206983 0.204717 0.228146 0.208788 0.204514 0.269491 0.269362 0.238376 0.238350
chargesum: 0.00000
title: Mulliken charges with hydrogens summed into heavy atoms:
elementType: O O N N C C C C C C C C C C C C C C C C C
charge: -0.200303 -0.200985 -0.104298 -0.216774 0.032781 0.021085 0.068323 0.021874 0.106957 0.068091 0.063990 0.082522 0.083264 0.179410 0.179706 -0.037089 -0.031229 -0.084991 -0.085251 0.026505 0.026415
polarizability: 2.65198393e+02 -1.12476435e+01 2.05622010e+02 3.08213349e+01 1.26123299e+01 1.49452187e+02
1716.lowfreq: -7.6507 -0.0006 0.0001 0.0007 1.7937 4.6239 13.5413 15.2364 22.7468
frequency: 13.2495 14.6433 22.6979 35.3052 54.5414 70.6339 81.8485 93.9179 106.1821 120.6845 122.9562 137.8389 169.9064 175.2644 204.0651 227.3552 229.8082 261.7778 263.6502 285.0651 304.0735 331.6478 348.6402 385.1724 413.1916 437.6357 456.0187 480.4664 485.2549 523.2825 542.7490 605.4382 659.0037 676.6530 699.7957 716.3071 730.5365 741.5435 750.8114 785.0729 794.7585 795.4869 796.5542 808.9229 857.7099 906.8491 911.1631 945.4517 949.9906 974.3894 975.4547 1005.8432 1009.6079 1019.6042 1029.2458 1040.3220 1066.8817 1072.4521 1073.2291 1073.6758 1083.8413 1085.0447 1090.3410 1138.1003 1167.1395 1170.6457 1191.8815 1202.5783 1204.5096 1219.9186 1236.4208 1266.8501 1277.1764 1283.2105 1284.1081 1288.2433 1294.2731 1304.2474 1328.0082 1336.1475 1350.0409 1359.1059 1362.9380 1370.0489 1376.2675 1386.7635 1388.0563 1415.9909 1446.8414 1453.2567 1455.8318 1458.4370 1461.9378 1465.3586 1468.1944 1470.2680 1477.8208 1479.6079 1485.4109 1487.9871 1491.0010 1615.0842 1617.7325 1627.1069 1676.0207 2838.7439 2844.0108 2858.5836 2953.4698 2976.2515 2981.6888 2982.7915 2986.3786 2997.9308 3011.8186 3019.6314 3027.5777 3034.0637 3040.0589 3052.8439 3073.4213 3074.9201 3081.0939 3091.4911 3091.8600 3138.9342 3152.7104 3164.4653 3174.2900
redmass: 5.9782 3.6905 4.7235 3.4825 3.1500 2.1016 2.0810 2.7817 2.2299 2.1231 4.4171 4.9834 1.8154 5.6635 1.5195 1.6098 4.2226 3.2357 2.8626 1.9927 2.6804 7.2974 2.8962 3.6805 3.1671 2.9567 4.8889 2.9420 2.8891 7.2067 6.1129 8.6541 4.8006 4.9443 5.4625 3.0860 1.0861 2.2045 1.3602 5.2807 1.1431 1.4732 1.3330 1.5898 2.7697 1.3879 1.8983 4.8944 1.6763 1.4163 2.5113 1.3448 2.8251 2.5373 2.2499 3.1099 2.9708 2.6420 2.5061 1.8834 2.0362 2.3404 2.2529 1.6722 1.2076 2.0360 2.2315 2.8228 2.2521 1.6036 1.4081 1.3185 1.1123 1.4890 1.1481 1.1844 1.1717 1.3372 1.2449 3.3597 1.5947 1.3339 1.3757 1.6320 1.4264 1.2323 1.2321 5.9501 1.2789 2.4647 2.0207 1.0771 1.0564 1.0687 1.0753 1.0578 1.0750 1.0637 1.0715 1.0878 1.0735 7.7108 8.3874 10.8080 11.7178 1.0714 1.0722 1.0711 1.0586 1.0619 1.0358 1.0357 1.0594 1.0977 1.0582 1.0869 1.0873 1.0873 1.1018 1.1029 1.0985 1.0979 1.1061 1.1002 1.1002 1.0864 1.0906 1.0956 1.1004
irintensity: 0.1571 0.2161 0.7746 0.1897 0.8440 0.0536 0.2464 1.3664 0.2965 1.3005 3.0305 0.0001 3.5049 0.6861 0.1974 0.5522 0.1820 2.8131 0.4606 1.1808 1.9430 15.9613 1.3953 4.1900 4.2850 5.7211 0.0004 2.8567 4.3707 9.2321 2.8451 11.3778 0.0142 0.2472 7.3643 78.3825 10.7761 4.9034 1.9813 0.0311 3.5452 15.8591 23.6938 0.1765 15.2678 0.0179 2.3523 17.6455 10.8864 1.9596 3.2124 0.0043 4.1762 2.6652 73.4172 6.3068 16.3367 8.1590 2.7930 17.8757 11.6453 9.6667 19.1318 13.3650 8.5495 2.9513 29.2750 11.5277 30.3182 5.7212 3.2043 6.9038 2.7260 0.5225 10.9048 11.2425 7.0649 23.4465 15.2690 261.2452 21.4564 2.6754 5.4713 56.8731 6.7044 21.0771 20.5337 11.0255 17.7934 11.1545 6.4681 1.3829 4.5971 0.5236 5.3663 0.7102 1.2480 4.9157 9.3120 21.3967 13.3449 1.9615 145.4893 300.7272 41.8361 41.5035 33.9603 248.0922 24.7170 19.8282 34.7105 30.6086 25.6184 9.2417 36.2082 11.2917 15.0173 20.5075 2.4086 74.1437 40.6652 87.2290 18.8258 29.5510 55.6140 1.7824 5.7359 6.2828 21.7333
temp: 298.150 k
press: 1.00000 atm
elementType: 8 8 7 7 6 6 6 6 6 6 6 6 6 6 6 6 6 6 6 6 6 1 1 1 1 1 1 1 1 1 1 1 1 1 1 1 1 1 1 1 1 1 1 1 1
symmnumber: 1
zpe: 996615.5 jmol-1
zpe.correction: 0.379591 hartree
zpe.thermalcorrener: 0.401693 hartree
zpe.thermalcorrenthalpy: 0.402638 hartree
zpe.thermalcorrgfe: 0.324182 hartree
zpe.sumelectzpe: -920.582318 hartree
zpe.sumelectthermal: -920.560215 hartree
zpe.sumelectthermalent: -920.559271 hartree
zpe.sumelectthermalfe: -920.637726 hartree
dipole: 1.4682 -0.5864 0.5108
dipole: 1.6614
quadrupole: -94.1803 -135.1078 -128.0648
quadrupole: -1.9869 13.2657 -3.7683
quadrupole: 24.9373 -15.9902 -8.9472 -1.9869 13.2657 -3.7683
hfenergy: -920.9619089 hartree
pointgroup: C01 [X(C17H24N2O2)]
dipole: 0.5806256 0.2339311 -0.1881801 debye
polarizability: 265.4107736|12.2275513|203.5240727|-30.1505549|16.3163624|151.3377435 unknown
InChI: InChI=1S/C17H24N2O2/c1-3-18(4-2)12-8-5-9-13-19-16(20)14-10-6-7-11-15(14)17(19)21/h6-7,10-11H,3-5,8-9,12-13H2,1-2H3
charge 0 multiplicity 1
45 atoms
O  2.174779 -2.481502 -0.198218
O  2.269412 1.917193 1.482509
N  -5.609873 0.236624 -0.20044
N  1.908822 -0.329388 0.783389
C  -1.956836 -0.333967 1.032482
C  -3.106769 0.06915 0.082088
C  -0.564376 -0.117364 0.400715
C  -4.500701 -0.181012 0.697077
C  0.572195 -0.523257 1.366669
C  -5.859716 1.702931 -0.152828
C  -6.848521 -0.564171 -0.004365
C  2.601823 -1.322235 0.030783
C  2.649435 0.885286 0.874428
C  3.892786 -0.683259 -0.386903
C  3.921377 0.639521 0.118811
C  -6.502064 2.245718 -1.444198
C  -6.760053 -1.968137 -0.633133
C  4.956335 -1.202127 -1.139547
C  5.014622 1.487462 -0.111089
C  6.067542 -0.351543 -1.379443
C  6.096265 0.972576 -0.873065
H  -2.031071 0.251245 1.973118
H  -2.070274 -1.40148 1.316297
H  -2.998733 1.139063 -0.18752
H  -3.038781 -0.500419 -0.864604
H  -0.441428 0.947644 0.123754
H  -0.480357 -0.712219 -0.529191
H  -4.565865 0.326816 1.694469
H  -4.603159 -1.264782 0.894259
H  0.480873 -1.591597 1.634266
H  0.522987 0.083853 2.2888
H  -4.886029 2.206424 -0.008055
H  -6.491004 1.98029 0.730599
H  -7.113071 -0.650337 1.081107
H  -7.681446 -0.018963 -0.484595
H  -5.854463 2.022574 -2.309773
H  -7.491832 1.792588 -1.636066
H  -6.643362 3.340898 -1.376596
H  -6.556844 -1.884886 -1.714856
H  -5.952104 -2.57237 -0.182029
H  -7.709163 -2.518194 -0.489414
H  4.923446 -2.226285 -1.524105
H  5.025861 2.50729 0.28602
H  6.916723 -0.72134 -1.964048
H  6.96721 1.605584 -1.074061
