program: Gaussian 09
title: 000231022
version: EM64L-G09RevD.01
frameworkgroup: C1[X(C19H16N4S)]
method: RPBEPBE
basis: SDD
operation: Freq
keyword: #p
keyword: freq=noraman
keyword: PBEPBE/SDD
title: #p freq=noraman PBEPBE/SDD
converged: YES YES NO NO
title: Mulliken charges:
elementType: S N N N N C C C C C C C C C C C C C C C C C C C H H H H H H H H H H H H H H H H
charge: 0.200951 -0.186232 -0.023716 0.043396 0.003953 -0.552410 0.360455 0.492301 -0.112516 -0.347226 -0.230984 -0.366011 -0.399517 -0.779859 0.472371 -0.230675 -0.219623 -0.399725 -0.237902 -0.385037 -0.368399 -0.221262 -0.221510 -0.235661 0.257053 0.237392 0.270497 0.244035 0.232002 0.300900 0.290095 0.231552 0.230587 0.249559 0.232562 0.237914 0.241461 0.229089 0.228916 0.231221
chargesum: 0.00000
title: Mulliken charges with hydrogens summed into heavy atoms:
elementType: S N N N N C C C C C C C C C C C C C C C C C C C
charge: 0.200951 -0.186232 -0.023716 0.043396 0.003953 -0.057964 0.360455 0.492301 -0.112516 -0.347226 0.039513 -0.121976 -0.167515 -0.188864 0.472371 0.000878 0.010964 -0.150166 -0.005340 -0.147123 -0.126938 0.007827 0.007407 -0.004440
polarizability: 3.22473382e+02 4.23898725e+01 2.40998879e+02 1.39652920e+01 -7.48180768e-01 1.80414742e+02
1716.lowfreq: -17.0936 -14.7970 0.0012 0.0016 0.0021 3.1261 5.9582 17.2277 20.7682
frequency: -16.1669 16.2682 20.3622 24.4675 35.2190 46.1900 57.4637 98.4449 120.5092 146.8664 184.8081 209.0575 229.7913 255.5296 283.8541 296.2715 319.2142 339.8980 401.7958 402.0131 407.9398 454.6196 472.9144 527.4360 540.1871 548.7146 562.6983 576.9274 601.5625 616.2828 617.0267 634.0342 646.8615 652.8644 701.7193 702.4447 732.4836 768.1393 775.3784 790.3705 795.7292 799.6412 809.9959 838.1722 852.3584 853.1910 882.4702 905.3342 922.5706 925.0612 928.8040 965.4615 977.5183 978.2976 989.9576 990.3746 997.5363 998.5799 1026.0713 1026.2795 1039.9371 1072.9219 1088.1913 1118.3150 1142.3139 1152.0275 1173.2404 1174.7630 1187.2192 1187.9986 1193.6343 1209.6793 1216.4026 1241.5315 1260.5829 1272.8811 1301.9967 1308.3502 1324.7878 1329.0778 1349.9949 1362.6295 1383.9330 1388.3174 1403.1342 1424.4202 1439.0659 1442.8698 1444.0488 1468.7243 1483.3277 1484.0390 1485.5183 1555.5652 1592.9054 1596.7270 1613.0576 1615.1816 2994.7553 3056.3445 3057.1924 3121.8903 3122.9236 3125.2771 3126.6153 3132.8928 3137.6626 3138.3050 3149.3180 3149.9374 3165.4873 3166.4397 3169.3802 3221.1129
redmass: 4.5292 4.2698 4.5039 4.4798 6.1453 5.8160 5.5887 7.5894 6.0977 5.8512 5.1393 7.7533 6.2076 4.6245 4.1666 3.1393 2.2652 6.2455 2.8069 2.8076 9.0337 2.9787 3.9225 5.7573 5.6200 6.1209 5.5425 7.8062 5.6899 6.3284 6.2360 6.5540 5.0196 5.2165 1.9571 1.8190 1.8078 3.6013 2.2076 7.2504 7.1364 4.1384 4.1513 1.5467 1.2541 1.2515 1.5355 1.3861 1.4290 3.4704 1.9549 2.0231 1.3933 1.3905 6.2235 5.9460 1.3190 1.3438 2.2026 2.3002 6.4763 1.4721 1.6126 1.0909 3.0821 3.3936 1.0527 1.0580 1.5752 1.3224 1.1427 2.3486 1.8979 1.6274 2.4961 8.3148 3.9497 1.5520 1.2812 1.9537 1.6663 3.2978 8.8196 4.7406 1.7342 3.5528 2.0989 2.0855 1.1565 1.2182 4.4858 3.0819 2.1360 8.7097 6.0967 6.0523 6.1202 5.9192 1.0626 1.0586 1.0994 1.0867 1.0851 1.0889 1.0868 1.1077 1.0921 1.0914 1.0965 1.0961 1.1017 1.1016 1.0921 1.0984
irintensity: 0.1661 0.1170 0.0322 0.0974 0.5350 0.5361 0.4741 2.4332 3.3690 0.9159 1.3181 0.0413 0.2229 0.7455 1.2654 2.9186 0.5735 2.3311 0.1447 0.0925 6.6238 8.1447 3.5936 8.5947 1.2101 6.3100 6.9555 32.5329 11.0359 0.0752 2.9629 1.1157 28.4144 10.8493 80.7119 7.8145 97.3950 7.0097 21.2716 5.8064 22.8716 7.0040 8.0301 16.1698 0.7835 0.4605 0.3136 2.8028 12.9372 55.9771 10.8733 7.0171 0.1532 0.0303 0.5783 0.9102 0.0850 0.3349 5.1222 8.5266 4.8100 8.4254 13.5870 1.8834 4.5845 47.7143 0.0162 0.1341 2.5608 2.8147 1.4701 16.5991 0.6011 43.3904 40.8399 15.2426 60.1777 4.4525 0.3778 74.5151 34.3304 53.4809 0.1790 2.2508 16.9449 94.7298 8.7504 5.8293 7.3048 49.7373 183.3530 33.3037 9.4472 74.7995 0.9797 1.6099 1.9468 3.9313 22.6222 5.3474 5.0984 5.8915 5.2453 0.4114 0.7335 1.9218 15.3449 11.5304 38.7780 28.7460 23.6484 19.8183 18.9884 1.1592
temp: 298.150 k
press: 1.00000 atm
elementType: 16 7 7 7 7 6 6 6 6 6 6 6 6 6 6 6 6 6 6 6 6 6 6 6 1 1 1 1 1 1 1 1 1 1 1 1 1 1 1 1
symmnumber: 1
zpe: 806563.5 jmol-1
zpe.correction: 0.307204 hartree
zpe.thermalcorrener: 0.326408 hartree
zpe.thermalcorrenthalpy: 0.327352 hartree
zpe.thermalcorrgfe: 0.255522 hartree
zpe.sumelectzpe: -1349.019258 hartree
zpe.sumelectthermal: -1349.000054 hartree
zpe.sumelectthermalent: -1348.999110 hartree
zpe.sumelectthermalfe: -1349.070940 hartree
dipole: 3.9569 5.1238 1.9959
dipole: 6.7745
quadrupole: -151.7820 -150.6997 -137.5997
quadrupole: -16.5195 -3.5234 -5.8153
quadrupole: -5.0882 -4.0059 9.0941 -16.5195 -3.5234 -5.8153
hfenergy: -1349.3264622 hartree
pointgroup: C01 [X(C19H16N4S1)]
dipole: -1.7124794 -1.8583191 0.8473123 debye
polarizability: 328.6541599|35.2358617|235.2068906|-13.7042063|-0.1968892|180.0259522 unknown
InChI: InChI=1S/C19H16N4S/c1-3-7-15(8-4-1)11-23-14-22-18-17(23)19(21-13-20-18)24-12-16-9-5-2-6-10-16/h1-10,13-14H,11-12H2
charge 0 multiplicity 1
40 atoms
S  -0.775272 0.632342 0.360698
N  2.575802 0.0860 1.017187
N  4.350206 1.374175 0.306247
N  3.025046 3.010762 -0.998608
N  0.605778 2.619372 -0.952355
C  1.895993 -1.055976 1.659763
C  2.028223 1.106808 0.226942
C  1.550785 -2.203354 0.7085
C  3.152639 1.901678 -0.207312
C  0.729036 1.518808 -0.165328
C  3.960433 0.305193 1.019005
C  2.384905 -2.536108 -0.386572
C  0.39626 -2.983286 0.960883
C  -2.122766 1.721724 -0.475668
C  -3.469458 1.077002 -0.262773
C  2.070835 -3.639162 -1.211778
C  0.085068 -4.089956 0.140538
C  1.742791 3.2989 -1.330592
C  0.923096 -4.422045 -0.94866
C  -4.291879 1.465028 0.826633
C  -3.939265 0.075785 -1.153001
C  -5.558707 0.870178 1.020051
C  -5.204979 -0.520185 -0.961642
C  -6.018823 -0.12446 0.126102
H  0.983746 -0.692297 2.164788
H  2.579762 -1.417428 2.452242
H  4.635795 -0.351341 1.566087
H  3.272601 -1.931346 -0.605936
H  -0.268825 -2.718193 1.791942
H  -1.8286 1.791017 -1.533161
H  -2.038639 2.71858 -0.018634
H  2.719503 -3.884824 -2.059897
H  -0.813411 -4.683042 0.343504
H  1.580801 4.172781 -1.967821
H  0.680635 -5.27639 -1.590211
H  -3.938616 2.237069 1.520853
H  -3.308946 -0.234273 -1.995052
H  -6.185714 1.183219 1.862313
H  -5.557498 -1.287978 -1.659349
H  -7.002441 -0.584377 0.273277
