program: Gaussian 09
title: 000231015
version: EM64L-G09RevD.01
frameworkgroup: C1[X(C14H19NO5)]
method: RPBEPBE
basis: SDD
operation: Freq
keyword: #p
keyword: freq=noraman
keyword: PBEPBE/SDD
title: #p freq=noraman PBEPBE/SDD
converged: YES YES NO NO
title: Mulliken charges:
elementType: O O O O O N C C C C C C C C C C C C C C H H H H H H H H H H H H H H H H H H H
charge: -0.436629 -0.429992 -0.464554 -0.293925 -0.257092 -0.489048 0.354961 -0.418116 -0.443759 -0.453493 0.206874 -0.414119 -0.240160 0.497741 -0.352668 -0.395158 0.325809 -0.361296 -0.366524 -0.536533 0.241274 0.244240 0.269114 0.166751 0.248321 0.271966 0.298909 0.353046 0.376102 0.353016 0.210242 0.268300 0.227510 0.237154 0.254193 0.245482 0.226085 0.250120 0.225856
chargesum: 0.00000
title: Mulliken charges with hydrogens summed into heavy atoms:
elementType: O O O O O N C C C C C C C C C C C C C C
charge: -0.083583 -0.053890 -0.111537 -0.293925 -0.257092 -0.190139 0.354961 0.067398 -0.007894 0.066794 0.206874 -0.203877 0.028139 0.497741 -0.125158 -0.158004 0.325809 -0.107102 -0.121041 0.165527
polarizability: 3.67806576e+02 -6.65049027e-01 1.39981969e+02 -6.40599745e-02 2.36611406e+01 1.26146695e+02
1716.lowfreq: -18.4165 -3.7589 0.0006 0.0006 0.0011 3.2745 17.9210 24.6208 40.4169
frequency: 15.3130 23.8822 40.3019 44.3172 62.5513 85.6400 109.9133 111.6184 125.6518 141.7188 162.1936 177.2843 187.8196 192.9293 236.4960 242.1631 258.4079 275.9886 295.0355 302.8256 339.2112 342.9547 365.0959 381.5017 391.4374 420.3524 425.6730 452.4087 516.1647 538.7679 550.6458 553.8044 632.6353 634.1289 684.9104 695.1705 701.6937 743.2343 759.1202 807.3476 814.9411 835.4490 843.3033 869.9715 875.4391 898.7963 946.8756 948.1457 963.6296 967.4107 967.9837 982.9157 998.7804 1000.1529 1010.5360 1014.2177 1070.1440 1094.2909 1111.2311 1114.1378 1144.4708 1157.1985 1169.4414 1181.1740 1209.0556 1216.5670 1225.9763 1244.5984 1251.0854 1294.1276 1312.5305 1319.3286 1329.0976 1348.4448 1365.6046 1369.3564 1381.4187 1382.0177 1385.8875 1433.5256 1436.4995 1458.8288 1467.5261 1467.8840 1470.9897 1471.9146 1474.4122 1503.9716 1569.1204 1570.7515 1621.1004 1647.5702 2924.5526 2966.5636 3014.2735 3033.4122 3057.4078 3081.7029 3089.5925 3092.8996 3106.6356 3109.6515 3130.1328 3132.3966 3138.7369 3165.9157 3170.4546 3458.2481 3513.5194 3569.2240 3577.1232
redmass: 6.0411 3.7838 5.2931 5.3000 5.4886 4.6674 5.6812 4.5481 3.6130 3.0133 3.9630 4.1397 4.0056 1.7426 3.6929 1.6009 2.7620 2.6136 2.0791 2.0621 1.6207 3.5513 2.0162 3.2852 6.0066 2.9262 5.0787 4.2526 2.3578 4.6349 1.2149 3.1379 6.2648 4.8825 2.1156 1.9247 2.4990 4.1044 5.3335 4.2106 1.3030 1.6241 4.8092 1.9036 2.0370 2.5124 3.0394 1.3854 2.1204 2.9439 1.3622 8.7428 3.6763 3.1960 1.2428 4.0011 2.1726 1.6573 1.2610 1.3692 1.8531 1.3258 1.4322 1.2634 1.6210 1.4644 2.3849 2.9851 1.5767 1.7102 1.3718 1.3785 1.5977 1.2942 1.2286 1.2335 1.2183 3.7158 1.2437 3.0587 1.2770 1.1887 1.0502 1.4601 1.0825 1.0778 1.1680 2.5369 6.3756 5.6339 6.1737 5.4903 1.0700 1.0327 1.0585 1.0606 1.1042 1.0934 1.1066 1.0906 1.0893 1.1055 1.0905 1.0988 1.0883 1.0942 1.0962 1.0652 1.0771 1.0661 1.0663
irintensity: 0.1395 0.2023 4.7523 1.5566 1.3329 4.1337 4.3784 5.0789 5.3121 9.8030 0.8335 1.2123 0.5358 0.4725 1.3901 0.2928 28.5126 57.2033 102.5521 23.7797 78.8438 17.3177 69.3291 8.3610 11.7996 0.0795 7.8943 5.2913 22.8664 34.0560 24.4177 9.3184 4.1739 14.6591 84.1083 71.6950 27.0576 0.3466 8.2044 3.7772 17.1030 86.4457 8.2366 9.2259 35.2773 26.5818 106.4522 11.2302 44.8962 32.7718 0.6076 64.3362 12.1179 18.2356 34.5983 124.9273 19.0294 33.2914 0.3251 12.7450 62.9813 4.7803 154.2862 157.5928 138.0462 7.4513 109.1068 278.1603 11.2084 5.4220 39.4309 17.8894 12.0892 19.6972 4.5402 90.5854 18.5304 9.9071 3.6009 59.3185 4.0872 65.1689 14.7513 246.1655 75.7156 19.8406 51.0873 202.9472 266.3855 109.2061 172.9634 156.4359 84.3151 82.9668 21.7839 21.2718 43.2630 8.7770 11.1058 0.0709 16.1769 14.9270 20.6100 12.4905 8.2646 16.1825 6.6549 41.7401 36.7790 5.4490 6.1540
temp: 298.150 k
press: 1.00000 atm
elementType: 8 8 8 8 8 7 6 6 6 6 6 6 6 6 6 6 6 6 6 6 1 1 1 1 1 1 1 1 1 1 1 1 1 1 1 1 1 1 1
symmnumber: 1
zpe: 822854.8 jmol-1
zpe.correction: 0.313409 hartree
zpe.thermalcorrener: 0.334676 hartree
zpe.thermalcorrenthalpy: 0.335620 hartree
zpe.thermalcorrgfe: 0.261162 hartree
zpe.sumelectzpe: -974.195551 hartree
zpe.sumelectthermal: -974.174284 hartree
zpe.sumelectthermalent: -974.173340 hartree
zpe.sumelectthermalfe: -974.247798 hartree
dipole: 7.8562 -1.5224 0.8537
dipole: 8.0477
quadrupole: -117.4617 -118.3077 -125.0266
quadrupole: 10.0472 -0.6626 5.5112
quadrupole: 2.8036 1.9577 -4.7613 10.0472 -0.6626 5.5112
hfenergy: -974.5089598 hartree
pointgroup: C01 [X(C14H19N1O5)]
dipole: -3.1049334 -0.5678035 -0.2489396 debye
polarizability: 367.7082309|-3.9284314|135.9232783|-3.2323312|-24.4428482|130.3037314 unknown
InChI: InChI=1S/C14H19NO5/c1-20-12-5-2-11(3-6-12)4-7-13(19)15-14(8-16,9-17)10-18/h2-7,15-18H,8-10H2,1H3
charge 0 multiplicity 1
39 atoms
O  3.818403 1.903604 1.650659
O  6.127726 -1.216447 0.619843
O  4.538598 -1.821217 -1.607668
O  1.689478 1.276178 -1.178938
O  -6.482164 -0.57951 0.670293
N  2.537782 -0.317734 0.304212
C  3.979049 -0.038843 0.075591
C  4.330102 1.455186 0.353874
C  4.769711 -0.951477 1.072148
C  4.38047 -0.367153 -1.387197
C  1.484212 0.358762 -0.312653
C  0.128615 -0.077991 0.115331
C  -0.984809 0.508689 -0.424479
C  -2.389414 0.218184 -0.133887
C  -2.813784 -0.775631 0.802405
C  -3.397699 0.95758 -0.812479
C  -5.16028 -0.259659 0.351759
C  -4.171881 -1.013269 1.043344
C  -4.769811 0.732762 -0.582624
C  -7.549398 0.165496 -0.007776
H  3.954849 2.095152 -0.465937
H  5.427592 1.537859 0.427886
H  4.858684 -0.436937 2.042987
H  4.21425 -1.906156 1.217159
H  5.377003 0.051195 -1.59842
H  3.645359 0.065547 -2.087681
H  2.306286 -0.995193 1.035562
H  2.844783 2.062408 1.564574
H  6.041986 -1.788041 -0.19305
H  3.645467 -2.246928 -1.589355
H  0.053837 -0.875392 0.867045
H  -0.785751 1.295295 -1.168332
H  -2.070091 -1.367532 1.346971
H  -3.096412 1.725511 -1.535247
H  -4.503009 -1.772129 1.758646
H  -5.512957 1.324154 -1.12512
H  -7.488177 1.24703 0.219488
H  -8.485425 -0.24727 0.394801
H  -7.511579 0.010119 -1.103036
