program: Gaussian 09
title: 000231008
version: EM64L-G09RevD.01
frameworkgroup: C1[X(C12H15NO2)]
method: RPBEPBE
basis: SDD
operation: Freq
keyword: #p
keyword: freq=noraman
keyword: PBEPBE/SDD
title: #p freq=noraman PBEPBE/SDD
converged: YES YES NO NO
title: Mulliken charges:
elementType: O O N C C C C C C C C C C C C H H H H H H H H H H H H H H H
charge: -0.260491 -0.313777 -0.146843 0.496274 -0.358442 -0.398678 -0.282568 0.321831 -0.361798 -0.367526 0.230690 -0.316296 -0.639940 -0.656530 -0.536842 0.225718 0.236366 0.270814 0.250710 0.242561 0.218585 0.222917 0.287927 0.223164 0.239768 0.239445 0.237107 0.247320 0.224261 0.224274
chargesum: 0.00000
title: Mulliken charges with hydrogens summed into heavy atoms:
elementType: O O N C C C C C C C C C C C C
charge: -0.260491 -0.313777 -0.146843 0.496274 -0.132724 -0.162312 -0.011754 0.321831 -0.111088 -0.124965 0.230690 -0.097712 0.094069 0.059790 0.159012
polarizability: 3.07915979e+02 7.83558899e+00 1.38644019e+02 1.48454338e-02 -5.10573508e-02 7.28254627e+01
1716.lowfreq: -0.0007 0.0004 0.0005 4.1418 7.3440 9.9608 27.6571 40.7553 63.9985
frequency: 26.9103 40.5598 63.9881 72.1033 90.3283 119.2125 134.7048 176.2401 183.1909 194.6361 204.3623 247.8345 264.2823 269.1333 363.8285 375.5482 406.5408 419.3619 435.0630 515.7757 516.1333 536.2814 607.6362 634.7565 677.2368 725.1895 740.8809 803.1537 813.2858 834.3152 873.8083 874.5800 946.4620 966.4830 977.5550 985.5857 1001.2209 1015.0700 1054.4564 1089.9699 1111.5716 1113.0715 1129.1850 1133.0314 1157.6533 1180.1141 1215.6894 1241.3934 1248.4154 1283.7837 1300.1514 1317.7777 1371.0257 1386.7414 1410.5180 1431.2671 1436.4377 1443.0077 1467.9414 1473.4493 1479.1796 1480.1379 1493.7536 1495.1719 1503.2717 1552.0864 1571.4428 1619.8814 1644.2340 2960.8066 2964.3940 2967.5384 3037.4440 3042.0428 3054.1444 3094.4077 3099.2988 3113.2109 3127.6651 3129.4240 3137.4518 3146.9497 3161.5855 3168.4829
redmass: 3.1714 3.2117 4.3153 1.9783 1.7387 3.6224 1.8797 1.3029 3.8658 2.3004 6.0567 1.3817 2.5292 3.6322 3.8569 4.1769 3.0389 2.9311 4.7255 4.1628 2.4895 5.0058 4.8762 6.7329 4.3590 5.2437 3.9866 6.1364 1.3051 1.6113 4.1608 1.9267 1.3692 1.3592 2.8443 8.5740 2.6199 1.2027 1.4400 1.2267 1.2602 1.3698 2.1033 1.3519 1.3305 1.2386 1.5328 3.0473 4.8401 2.3292 1.4432 1.3910 3.2504 3.0022 1.2280 3.6338 1.1950 1.2073 1.0498 1.0769 1.1078 1.0491 1.0465 1.1281 2.5162 6.4105 6.8509 6.2350 5.6772 1.0351 1.0327 1.0367 1.1018 1.1021 1.1041 1.0973 1.0892 1.0967 1.0929 1.0961 1.0884 1.0891 1.0945 1.0963
irintensity: 4.8850 0.2040 2.4124 1.2717 0.3305 9.1954 0.0275 0.2467 0.2390 0.3204 1.0250 0.1164 4.8463 3.0408 25.2628 2.4983 3.2983 0.1165 1.9457 5.4897 20.4902 36.0883 4.3132 2.3542 0.2422 4.2156 0.0569 3.6164 17.5577 80.1952 12.2078 5.7763 1.8341 0.7887 23.7100 46.0005 4.6652 40.6539 19.0188 0.2663 0.1854 14.1638 335.9444 2.0358 9.5501 112.4445 0.8040 244.9323 37.3808 3.3104 5.8256 30.2454 68.5264 85.6281 69.8632 46.2343 9.3564 25.8451 14.0023 56.3835 3.8499 22.0874 5.8311 102.8386 177.1242 193.8372 31.6514 175.5263 139.2980 71.3284 95.6928 82.0673 41.5577 38.2849 46.2378 27.3408 0.4539 1.7585 29.0334 5.2137 9.9558 19.0899 18.1987 7.9192
temp: 298.150 k
press: 1.00000 atm
elementType: 8 8 7 6 6 6 6 6 6 6 6 6 6 6 6 1 1 1 1 1 1 1 1 1 1 1 1 1 1 1
symmnumber: 1
zpe: 641042.3 jmol-1
zpe.correction: 0.244160 hartree
zpe.thermalcorrener: 0.259903 hartree
zpe.thermalcorrenthalpy: 0.260847 hartree
zpe.thermalcorrgfe: 0.199739 hartree
zpe.sumelectzpe: -670.337365 hartree
zpe.sumelectthermal: -670.321622 hartree
zpe.sumelectthermalent: -670.320678 hartree
zpe.sumelectthermalfe: -670.381786 hartree
dipole: -2.0501 2.6528 0.0180
dipole: 3.3527
quadrupole: -62.1215 -87.7351 -93.7236
quadrupole: 23.4903 0.0275 -0.0404
quadrupole: 19.0719 -6.5417 -12.5302 23.4903 0.0275 -0.0404
hfenergy: -670.5815255 hartree
pointgroup: C01 [X(C12H15N1O2)]
dipole: 0.8321802 1.022004 -0.0539647 debye
polarizability: 307.3828628|-12.1383624|139.0705626|-2.544523|-2.1452482|72.9320347 unknown
InChI: InChI=1S/C12H15NO2/c1-13(2)12(14)9-6-10-4-7-11(15-3)8-5-10/h4-9H,1-3H3
charge 0 multiplicity 1
30 atoms
O  4.824075 0.695944 -0.057982
O  -3.395498 -1.666081 0.134158
N  -4.245878 0.507281 0.064125
C  0.694516 -0.312348 0.028971
C  1.161152 1.03807 -0.020571
C  1.673301 -1.343969 0.049438
C  -0.724809 -0.678917 0.060249
C  3.486623 0.284436 -0.02693
C  2.52938 1.335259 -0.048128
C  3.055427 -1.064536 0.022371
C  -3.183615 -0.404874 0.084172
C  -1.805376 0.161387 0.045159
C  -5.623583 -0.011226 0.098959
C  -4.069819 1.969861 0.002369
C  5.857687 -0.343844 -0.037435
H  0.44191 1.86413 -0.037112
H  1.340277 -2.388312 0.087642
H  -0.961599 -1.752508 0.101056
H  2.890844 2.367421 -0.085955
H  3.77357 -1.889512 0.039978
H  -1.673042 1.247359 0.00466
H  -6.165436 0.366147 0.987704
H  -5.567734 -1.10953 0.146616
H  -6.182035 0.285863 -0.809969
H  -3.55381 2.288542 -0.923476
H  -3.508896 2.358149 0.873617
H  -5.064453 2.4445 0.009296
H  6.812301 0.201034 -0.067976
H  5.777211 -1.007059 -0.920241
H  5.801009 -0.947566 0.888836
