program: Gaussian 09
title: 000231002
version: EM64L-G09RevD.01
frameworkgroup: C1[X(C17H22O3)]
method: RPBEPBE
basis: SDD
operation: Freq
keyword: #pfreq=noraman
keyword: PBEPBE/SDD
title: #p freq=noraman PBEPBE/SDD
converged: YES YES NO NO
title: Mulliken charges:
elementType: O O O C C C C C C C C C C C C C C C C C H H H H H H H H H H H H H H H H H H H H H H
charge: -0.282345 -0.266547 -0.257984 0.017196 -0.425175 -0.436139 -0.407357 -0.401118 -0.385004 -0.373702 0.224074 -0.368389 -0.267363 0.502238 -0.350665 -0.394672 -0.361985 -0.364718 0.326392 -0.536774 0.208272 0.198533 0.214520 0.195953 0.194694 0.199508 0.189721 0.193238 0.197404 0.198388 0.190732 0.235521 0.217464 0.248304 0.261220 0.234599 0.235307 0.253525 0.243837 0.225261 0.248957 0.225080
chargesum: 0.00000
title: Mulliken charges with hydrogens summed into heavy atoms:
elementType: O O O C C C C C C C C C C C C C C C C C
charge: -0.282345 -0.266547 -0.257984 0.225468 -0.012122 -0.045492 -0.018128 -0.010476 0.004116 0.079283 0.224074 -0.120085 -0.006143 0.502238 -0.116066 -0.159365 -0.108461 -0.120881 0.326392 0.162524
polarizability: 3.79521550e+02 -3.48202286e+01 1.34428409e+02 -9.92433359e+00 -8.03383046e+00 1.65336166e+02
1716.lowfreq: -15.6933 -3.2406 -0.0008 0.0005 0.0011 10.0077 18.5390 25.5749 31.8511
frequency: -8.4455 25.1084 31.0126 40.7951 65.3832 66.5825 109.1008 129.1707 149.0831 175.1727 191.9922 197.1898 218.3316 226.2884 245.5274 263.9324 286.9042 323.2951 374.6040 377.9020 415.9940 420.3409 428.4317 432.3599 446.5049 516.1255 525.0866 538.6453 540.9225 632.2422 667.6618 670.0069 738.2067 740.8102 774.2638 784.2371 813.3556 819.1105 837.7134 837.9270 850.2660 884.7085 885.4329 897.3243 921.9420 946.9295 949.7261 961.9421 970.0395 983.2786 984.8680 999.7783 1009.2229 1049.0022 1057.3977 1080.7585 1102.8490 1110.7856 1111.4135 1114.2607 1117.5582 1155.0741 1157.1606 1179.2655 1185.9232 1215.9810 1224.2088 1243.2776 1249.6657 1258.4513 1271.7840 1283.9645 1294.2109 1307.1611 1316.0896 1317.8165 1334.4153 1337.3286 1340.8571 1345.1474 1361.9500 1365.3284 1383.5405 1432.8120 1436.3661 1456.4587 1459.9193 1462.2358 1462.4403 1467.7002 1469.0187 1471.9104 1475.9574 1503.0978 1569.8033 1601.1317 1624.8069 1642.6372 2954.7373 2961.3085 2964.6193 2964.9608 2965.2360 2966.0490 2973.7796 3005.0285 3016.0999 3026.0382 3028.4811 3035.9316 3044.5315 3055.8885 3077.6104 3097.5543 3128.1827 3130.8874 3142.8892 3159.1068 3162.1576 3170.9434
redmass: 4.8201 4.1562 2.9380 4.5548 6.3174 4.4108 3.9280 3.1368 3.5964 4.3391 3.2445 2.1832 2.0051 3.5108 1.4723 4.0022 3.2840 1.9452 3.8032 3.8290 2.0367 2.8879 2.8679 4.0125 3.2526 2.4102 2.7988 4.8906 2.3281 6.9868 5.1242 5.3968 5.2435 3.8566 2.3280 1.5385 1.3157 5.6873 1.5978 1.9447 1.8734 2.3837 2.0733 1.7136 2.3505 1.3722 2.0411 2.4057 1.3603 3.5644 5.5439 2.6340 1.1957 1.8106 1.1268 1.4815 2.3455 1.6881 1.3075 2.3043 2.4596 2.4269 1.3372 1.2431 1.4939 1.5889 1.2914 2.9553 1.2001 1.2638 1.2837 1.2039 1.5349 1.9856 1.3128 1.3850 1.3694 1.4512 1.4567 1.4774 1.4070 1.5469 3.7760 3.1586 1.2646 1.0927 1.0893 1.0931 1.0916 1.0499 1.0818 1.0765 1.0957 2.5260 6.8416 8.8086 6.9110 5.6902 1.0640 1.0744 1.0628 1.0594 1.0330 1.0675 1.0660 1.0565 1.0989 1.0964 1.0991 1.1012 1.1026 1.1042 1.1080 1.0897 1.0901 1.0989 1.0884 1.0913 1.0946 1.0966
irintensity: 0.7027 0.2293 0.3075 1.2889 0.6081 0.5949 5.0778 2.7512 1.4938 0.2721 0.4907 0.3922 0.7158 1.4359 0.3270 5.6208 8.1430 3.9445 6.6649 19.4219 3.5125 0.2016 0.5233 1.1553 3.7489 19.9454 3.0199 35.2112 6.6338 2.2354 2.6357 5.0286 10.6500 0.1638 0.8059 0.1263 19.4285 9.9599 78.4163 9.1862 3.8797 11.6736 6.6391 3.3920 1.8609 2.8763 34.7815 37.1017 0.9607 193.6088 5.9315 0.5621 44.3697 1.6862 1.1737 22.5577 82.2790 261.0769 35.4389 26.6553 404.2235 8.8925 17.0474 119.2935 3.7468 10.7490 3.1253 294.1092 1.7819 2.1942 1.7712 1.0274 2.0654 67.4027 6.8276 15.8227 0.2280 1.9383 0.6715 0.4092 3.6221 2.3204 16.4551 58.0312 3.8750 7.8434 10.9531 3.4620 18.3211 14.3454 27.9416 52.6779 2.3505 154.7116 46.3494 543.1338 65.7757 182.3922 26.3333 15.2783 27.3948 37.6293 91.7912 33.7374 34.4391 53.1448 74.3003 85.9534 34.4290 28.1360 109.6747 44.4188 23.0061 2.2986 20.3119 13.5344 7.1905 8.0468 17.0914 7.8616
temp: 298.150 k
press: 1.00000 atm
elementType: 8 8 8 6 6 6 6 6 6 6 6 6 6 6 6 6 6 6 6 6 1 1 1 1 1 1 1 1 1 1 1 1 1 1 1 1 1 1 1 1 1 1
symmnumber: 1
zpe: 925692.6 jmol-1
zpe.correction: 0.352578 hartree
zpe.thermalcorrener: 0.371358 hartree
zpe.thermalcorrenthalpy: 0.372302 hartree
zpe.thermalcorrgfe: 0.304033 hartree
zpe.sumelectzpe: -885.162274 hartree
zpe.sumelectthermal: -885.143494 hartree
zpe.sumelectthermalent: -885.142549 hartree
zpe.sumelectthermalfe: -885.210819 hartree
dipole: -2.8788 1.1410 0.0002
dipole: 3.0967
quadrupole: -79.2903 -124.4142 -118.1846
quadrupole: -2.0822 -14.0967 2.0280
quadrupole: 28.0060 -17.1178 -10.8882 -2.0822 -14.0967 2.0280
hfenergy: -885.5148518 hartree
pointgroup: C01 [X(C17H22O3)]
dipole: -1.1288586 -0.4407286 -0.1255841 debye
polarizability: 378.9803113|32.707274|141.7241218|19.3610508|-14.9236393|158.5816919 unknown
InChI: InChI=1S/C17H22O3/c1-19-16-10-7-14(8-11-16)9-12-17(18)20-13-15-5-3-2-4-6-15/h7-12,15H,2-6,13H2,1H3
charge 0 multiplicity 1
42 atoms
O  2.06549 0.814339 1.132303
O  1.397615 1.828562 -0.880554
O  -6.629361 -1.059329 0.472309
C  4.375462 0.046523 0.62716
C  3.983024 -0.678256 -0.68406
C  5.858744 0.501826 0.577901
C  4.928556 -1.86661 -0.979371
C  6.806607 -0.685878 0.281847
C  6.407232 -1.413406 -1.02407
C  3.471304 1.256933 0.913565
C  1.118659 1.153174 0.145443
C  -0.198939 0.604159 0.51272
C  -1.286172 0.80234 -0.297875
C  -2.653072 0.322939 -0.087772
C  -3.052258 -0.439136 1.054436
C  -3.64534 0.619814 -1.062795
C  -4.37225 -0.87864 1.207449
C  -4.979053 0.184853 -0.925897
C  -5.345149 -0.569843 0.217183
C  -7.6786 -0.773838 -0.512279
H  4.263354 -0.671084 1.468341
H  4.023241 0.047517 -1.522676
H  2.936873 -1.032358 -0.618587
H  6.141985 0.985547 1.534485
H  5.976817 1.267097 -0.218463
H  4.645132 -2.346268 -1.936213
H  4.807894 -2.635128 -0.187365
H  6.764689 -1.404921 1.126356
H  7.85234 -0.326999 0.21796
H  7.071226 -2.283305 -1.193935
H  6.551563 -0.725364 -1.882989
H  3.488351 1.979473 0.076445
H  3.762762 1.75721 1.854286
H  -0.243826 0.040148 1.449226
H  -1.106291 1.386614 -1.212825
H  -2.318289 -0.687475 1.828269
H  -3.362173 1.203289 -1.947385
H  -4.684453 -1.461781 2.07903
H  -5.710933 0.433497 -1.699949
H  -7.842372 0.315805 -0.618122
H  -8.584799 -1.248871 -0.109844
H  -7.432188 -1.212464 -1.49829
