program: Gaussian 09
title: 000231000
version: EM64L-G09RevD.01
frameworkgroup: C1[X(C18H26O3)]
method: RPBEPBE
basis: SDD
operation: Freq
keyword: #pfreq=noraman
keyword: PBEPBE/SDD
title: #p freq=noraman PBEPBE/SDD
converged: YES YES NO NO
title: Mulliken charges:
elementType: O O O C C C C C C C C C C C C C C C C C C H H H H H H H H H H H H H H H H H H H H H H H H H H
charge: -0.275481 -0.264157 -0.256844 -0.380519 -0.371443 -0.374848 -0.352904 -0.379399 -0.356473 -0.318541 -0.696205 0.220952 -0.364471 0.500623 -0.270762 -0.373853 -0.372927 0.321779 -0.357753 -0.361751 -0.537369 0.198840 0.192086 0.188154 0.191620 0.200429 0.188548 0.187224 0.189476 0.205812 0.234221 0.195512 0.194318 0.229073 0.219320 0.210219 0.215012 0.209443 0.246070 0.261217 0.230530 0.239383 0.242376 0.254755 0.249181 0.224747 0.224778
chargesum: 0.00000
title: Mulliken charges with hydrogens summed into heavy atoms:
elementType: O O O C C C C C C C C C C C C C C C C C C
charge: -0.275481 -0.264157 -0.256844 0.010407 0.008332 0.014129 0.023795 0.060635 0.033356 0.129852 -0.061531 0.220952 -0.118401 0.500623 -0.009545 -0.143323 -0.133543 0.321779 -0.115377 -0.106996 0.161338
polarizability: 3.94896387e+02 -4.81897841e+01 1.47082616e+02 2.71897088e+00 1.79362646e+00 1.83240602e+02
1716.lowfreq: -15.3965 -0.7063 -0.0012 0.0007 0.0018 6.1096 13.7062 17.9873 28.3503
frequency: 0.4355 17.6227 28.0944 37.4000 41.9091 58.0120 65.4526 67.4362 88.6671 97.6033 112.0545 137.3076 141.1641 143.4072 161.7397 178.9162 194.9711 213.8093 229.2333 239.0883 255.7458 263.7508 293.7997 323.5537 375.4095 394.1104 416.8967 429.2557 458.8918 490.2481 508.6139 516.6903 545.9311 632.3347 664.6868 673.6584 721.6402 731.5077 737.9561 741.2436 756.1265 796.8759 815.0735 820.5477 836.7829 862.7954 887.0111 888.9205 899.5233 939.8125 949.2780 967.8905 970.3417 983.8184 992.6885 1000.4028 1011.7102 1012.1767 1021.2816 1044.8622 1071.6246 1076.0147 1080.1662 1110.9901 1111.3571 1117.7764 1125.2706 1156.1497 1167.9894 1178.7958 1192.7352 1217.9211 1219.6698 1231.3894 1244.1323 1263.7811 1267.7112 1280.6103 1288.9370 1293.5309 1297.3700 1298.5283 1303.9180 1309.9496 1319.1227 1337.7967 1353.3769 1355.7396 1371.3383 1381.6216 1388.4126 1431.0590 1437.5651 1452.1897 1461.7939 1462.5904 1467.2401 1467.6001 1470.6359 1471.8413 1476.8442 1478.7279 1485.4069 1488.8547 1504.1592 1570.1953 1600.4528 1623.8682 1644.3596 2950.1084 2952.4029 2954.6370 2962.2083 2964.8522 2968.0842 2971.4293 2985.1000 2989.6986 2993.9576 3005.3122 3016.8008 3022.7249 3037.7075 3053.4110 3055.6087 3068.0493 3070.3481 3096.1186 3098.0800 3130.0661 3132.7150 3139.1558 3157.5309 3165.1447 3171.7447
redmass: 4.0767 3.4560 1.9761 3.8842 3.7933 4.4571 4.1133 4.1875 1.8029 2.6376 4.0942 1.8822 2.5711 2.7523 3.8401 4.3265 1.9675 3.3758 1.1283 1.6025 4.8413 3.6630 3.2754 3.9664 3.7998 4.4643 2.9336 3.1350 3.7005 3.6657 5.2333 2.4792 4.4539 6.8945 4.6850 4.9490 1.0638 1.0856 4.5187 3.9200 1.1365 1.2370 1.3085 5.0375 1.5926 1.2570 2.0770 1.8883 4.1870 1.2691 1.3769 1.3470 4.5558 8.6253 4.8374 2.6256 1.1993 1.1794 3.3735 3.2659 2.8140 2.4474 2.1801 1.2818 1.5338 2.4608 3.0561 1.3434 1.8025 1.2563 1.5859 1.6038 1.2797 1.3668 2.7822 1.2882 1.2480 1.0243 1.1083 1.1100 1.4678 1.1300 1.3862 2.1304 1.3424 1.4206 1.6359 1.5972 1.4966 3.2383 1.2171 2.8810 1.3140 1.1001 1.0715 1.0740 1.0687 1.0500 1.0753 1.0786 1.0427 1.0795 1.0872 1.0946 2.5261 6.7449 8.7861 6.7173 5.7066 1.0589 1.0587 1.0591 1.0593 1.0328 1.0588 1.0365 1.0961 1.0645 1.0946 1.1017 1.0575 1.1040 1.1044 1.1032 1.1043 1.1006 1.0994 1.1081 1.0899 1.0995 1.0898 1.0881 1.0913 1.0950 1.0957
irintensity: 0.3234 1.1267 0.1075 0.3769 0.1187 0.0970 0.0412 0.0758 0.0106 0.1481 7.3122 0.0947 0.8215 0.8018 0.1413 2.5932 0.2153 0.8436 0.0217 0.4157 1.8270 9.2010 1.1568 17.2463 1.6469 4.9206 0.4181 1.0944 1.2621 1.2291 40.8706 24.6219 12.9840 0.2794 8.6393 0.9589 13.5074 0.3600 2.0708 0.0382 4.4183 1.0664 11.1120 14.3484 83.5138 0.3712 0.6649 4.1202 14.1742 6.1783 1.8522 2.7854 139.8926 44.2920 8.0345 3.2722 37.2939 6.9016 22.1727 2.0458 9.9285 0.5137 0.6478 20.9571 224.0554 419.1497 182.1517 0.5868 11.3732 147.7127 1.7182 12.8782 14.3378 4.8030 258.1264 2.9540 2.7415 0.3489 0.3165 0.6624 1.5494 0.1954 8.1425 69.6878 1.1200 3.5062 0.6952 0.3273 12.3337 83.5707 11.2640 3.6856 10.0259 20.9683 0.0914 0.4501 0.1348 14.3836 80.8874 1.4825 12.3289 1.5250 2.0396 31.8165 135.4886 5.6792 605.5595 76.7243 151.2479 0.0621 4.8658 0.5761 27.0238 77.6698 148.6318 37.8456 0.1743 18.8114 4.1392 1.8341 64.5397 0.1797 94.8992 51.4301 44.8592 93.1406 60.4963 34.0405 3.4711 27.4473 8.5168 6.8588 6.8202 17.4107 7.3463
temp: 298.150 k
press: 1.00000 atm
elementType: 8 8 8 6 6 6 6 6 6 6 6 6 6 6 6 6 6 6 6 6 6 1 1 1 1 1 1 1 1 1 1 1 1 1 1 1 1 1 1 1 1 1 1 1 1 1 1
symmnumber: 1
zpe: 1049186.4 jmol-1
zpe.correction: 0.399614 hartree
zpe.thermalcorrener: 0.423343 hartree
zpe.thermalcorrenthalpy: 0.424287 hartree
zpe.thermalcorrgfe: 0.338468 hartree
zpe.sumelectzpe: -925.555646 hartree
zpe.sumelectthermal: -925.531917 hartree
zpe.sumelectthermalent: -925.530973 hartree
zpe.sumelectthermalfe: -925.616792 hartree
dipole: -2.3388 0.9262 -3.0831
dipole: 3.9791
quadrupole: -92.4087 -131.4035 -122.4239
quadrupole: -7.4757 13.3360 0.3772
quadrupole: 23.0034 -15.9915 -7.0119 -7.4757 13.3360 0.3772
hfenergy: -925.9552601 hartree
pointgroup: C01 [X(C18H26O3)]
dipole: -0.9017103 0.9725675 -0.8317702 debye
polarizability: 391.8960625|-49.1165181|157.9924686|-25.5274338|-14.2479313|175.3310743 unknown
InChI: InChI=1S/C18H26O3/c1-3-4-5-6-7-8-15-21-18(19)14-11-16-9-12-17(20-2)13-10-16/h9-14H,3-8,15H2,1-2H3
charge 0 multiplicity 1
47 atoms
O  0.778283 -0.69688 -1.485377
O  0.401987 -1.712759 0.595562
O  -7.697229 1.2785 0.727044
C  5.540648 0.326586 -0.096226
C  7.025739 -0.09262 -0.177352
C  4.587389 -0.661026 -0.806646
C  7.978926 0.899434 0.526581
C  3.107691 -0.217663 -0.733521
C  9.466358 0.487942 0.437412
C  2.180417 -1.201659 -1.460489
C  10.411162 1.485944 1.141402
C  -0.016383 -1.015286 -0.366947
C  -1.356889 -0.42436 -0.521154
C  -3.685098 -0.090384 0.448663
C  -2.314968 -0.606405 0.441775
C  -4.228882 0.710011 -0.595868
C  -4.532336 -0.397665 1.556952
C  -6.37145 0.863683 0.569236
C  -5.551943 1.18575 -0.546372
C  -5.853358 0.067578 1.623036
C  -8.289534 2.103081 -0.331845
H  5.242307 0.420044 0.968518
H  5.420135 1.335762 -0.542803
H  7.321524 -0.189986 -1.243192
H  7.148368 -1.100265 0.272316
H  4.697641 -1.666877 -0.350831
H  4.893585 -0.762065 -1.869239
H  7.852354 1.908835 0.081561
H  7.68914 0.992884 1.594215
H  2.995761 0.786028 -1.188343
H  2.791852 -0.139063 0.32385
H  9.592787 -0.520103 0.882797
H  9.754376 0.393967 -0.629756
H  2.193792 -2.192594 -0.970899
H  2.447097 -1.297802 -2.526734
H  10.162457 1.576056 2.215814
H  11.467611 1.168925 1.064546
H  10.327207 2.494194 0.693276
H  -1.526124 0.154821 -1.434095
H  -2.015961 -1.211041 1.311225
H  -3.610018 0.966724 -1.462548
H  -4.137501 -1.012533 2.374515
H  -5.934894 1.798368 -1.367902
H  -6.502891 -0.167163 2.471288
H  -9.318446 2.299913 0.001986
H  -8.306832 1.562985 -1.297886
H  -7.744854 3.059783 -0.447348
