program: Gaussian 09
title: 000230978
version: EM64L-G09RevD.01
frameworkgroup: C1[X(C9H5ClO2)]
method: RPBEPBE
basis: SDD
operation: Freq
keyword: #p
keyword: freq=noraman
keyword: PBEPBE/SDD
title: #p freq=noraman PBEPBE/SDD
converged: NO NO NO NO
title: Mulliken charges:
elementType: Cl O O C C C C C C C C C H H H H H
charge: -0.038780 -0.247793 -0.184584 0.456126 0.188746 -0.287110 -0.211640 -0.354203 -0.263027 -0.188834 -0.293980 0.121252 0.265035 0.273113 0.263438 0.244478 0.257762
chargesum: 0.00000
title: Mulliken charges with hydrogens summed into heavy atoms:
elementType: Cl O O C C C C C C C C C
charge: -0.038780 -0.247793 -0.184584 0.456126 0.188746 -0.287110 0.053396 -0.081090 0.000411 0.055645 -0.036217 0.121252
polarizability: 1.72036067e+02 -1.33705436e+01 1.29975785e+02 1.29762460e-03 1.01652363e-02 4.19598790e+01
1716.lowfreq: -6.0914 -1.3400 -0.0027 -0.0021 0.0026 6.8177 81.5449 126.3583 184.7938
frequency: 81.5421 126.3514 184.7938 202.8094 256.5185 329.7753 369.0632 379.7774 437.6056 481.4369 505.5171 537.8689 563.1700 620.4408 662.1469 710.5242 744.5913 770.3637 791.9859 810.6468 843.0132 897.5631 908.6558 974.9966 995.4954 1037.4227 1058.5001 1136.2979 1173.2525 1202.4226 1241.2499 1249.3232 1373.7915 1393.2732 1427.8777 1456.5105 1549.5164 1594.4613 1617.2092 1696.0529 3154.0800 3156.3943 3178.2727 3187.9177 3189.6777
redmass: 7.8923 6.5301 13.2701 4.8265 5.8231 8.9475 9.6517 3.9387 9.4014 6.5361 3.2415 7.0627 5.1700 9.5241 3.2614 7.4507 3.1167 7.9831 1.5840 5.1571 1.6495 1.3805 8.7238 1.3337 1.2993 3.5671 1.9037 2.3350 1.2608 1.5224 2.1873 1.9280 1.9806 5.8960 2.5322 3.7801 6.6167 7.6982 7.5673 11.0895 1.0882 1.0895 1.0930 1.0988 1.0966
irintensity: 4.6909 2.4532 1.2268 5.0780 0.7176 1.3714 6.6316 0.5328 1.2289 3.6697 0.5810 12.2800 0.7629 13.1714 3.1038 13.9899 2.6482 30.1825 89.6746 45.2735 47.6602 0.6081 88.5427 2.0847 0.1236 78.3589 0.9484 9.0147 8.6887 7.5774 26.8237 10.6677 8.4739 3.1573 76.6073 6.0174 36.3806 48.4102 104.1402 527.1707 4.9321 2.8882 0.7212 3.5736 1.1613
temp: 298.150 k
press: 1.00000 atm
elementType: 17 8 8 6 6 6 6 6 6 6 6 6 1 1 1 1 1
symmnumber: 1
zpe: 300622.5 jmol-1
zpe.correction: 0.114501 hartree
zpe.thermalcorrener: 0.123739 hartree
zpe.thermalcorrenthalpy: 0.124683 hartree
zpe.thermalcorrgfe: 0.079423 hartree
zpe.sumelectzpe: -955.639431 hartree
zpe.sumelectthermal: -955.630193 hartree
zpe.sumelectthermalent: -955.629249 hartree
zpe.sumelectthermalfe: -955.674509 hartree
dipole: -4.0932 0.3524 -0.0001
dipole: 4.1083
quadrupole: -92.3297 -63.3532 -77.4509
quadrupole: -7.4756 -0.0015 0.0015
quadrupole: -14.6184 14.3581 0.2604 -7.4756 -0.0015 0.0015
hfenergy: -955.7539321 hartree
pointgroup: C01 [X(C9H5Cl1O2)]
dipole: 1.6002446 -0.2275482 0.0000398 debye
dipolederiv: -0.2634919 0.2176092 -0.0000239 0.3601892 -0.6330621 0.000065 -0.0000402 0.0000643 -0.0534024 -1.3195095 -0.0315079 0.0000036 -0.465314 -0.4206471 0.00002 0.0000742 0.0000305 -0.2029113 -1.5129684 0.0586072 0.0000141 0.3680885 -0.4104999 0.0000032 -0.0000891 0.0000118 -0.3290343 -0.4842582 0.0389764 0.0000015 -0.1006976 -0.4618021 0.0000594 0.000013 0.0000551 0.0247789 0.7864523 -0.0813484 0.0000045 0.0409676 0.2076452 -0.0000076 -0.0000116 -0.0000049 0.143245 0.6894867 -0.1895098 0.0000142 -0.529363 1.0259849 -0.0001221 0.0000536 -0.0001216 -0.0590884 0.618592 0.0549787 -0.0000178 0.3248624 0.244343 -0.000037 -0.0000362 -0.0000375 -0.0559919 -0.3035126 0.0168056 -0.0000013 -0.1329931 0.0427534 -0.0000264 0.0000223 -0.00003 -0.1764925 -0.0949035 -0.0031228 0.0000016 -0.1075391 -0.5174926 0.0000479 0.0000161 0.0000468 -0.1207399 0.0675126 -0.1437565 0.0000164 0.057231 0.2232878 -0.0000443 -0.0000109 -0.0000429 -0.1263962 -0.6071865 0.0800277 -0.0000013 0.4867504 -0.1067943 -0.0000059 -0.0000491 -0.0000096 -0.1670261 2.2199501 -0.0237014 -0.0000138 -0.2498016 0.7086071 -0.0000389 0.0000459 -0.0000487 0.286662 0.1036528 0.0685183 -0.0000077 -0.0000983 -0.0019804 0.0000155 0.000003 0.0000178 0.1447831 0.0782724 0.0593648 -0.0000067 0.0305535 0.00609 0.0000216 -0.0000024 0.000021 0.1813484 -0.0300593 0.0181866 -0.0000013 0.0288007 0.0964576 0.0000094 -0.0000021 0.0000086 0.1742451 0.0169839 -0.0823224 0.000011 -0.0761287 -0.0242209 0.0000234 0.0000099 0.0000252 0.1600005 0.034987 -0.0578052 0.0000068 -0.035508 0.0213305 0.000017 0.0000037 0.0000138 0.17602 unknown
polarizability: 175.7702454|2.7868893|126.2416064|-0.0010247|-0.0101964|41.959879 unknown
InChI: InChI=1S/C9H5ClO2/c10-7-2-1-3-8-6(7)4-5-9(11)12-8/h1-5H
charge 0 multiplicity 1
17 atoms
Cl 2.524639 -2.329363 0.000367
O  -1.490255 1.08167 -0.000001
O  -3.677738 0.333031 0.000063
C  0.390672 -0.502324 0.000173
C  -0.117997 0.835507 0.000012
C  1.80637 -0.652151 0.00018
C  -0.564024 -1.590417 0.000308
C  0.735264 1.959852 -0.000136
C  2.676677 0.444523 0.000041
C  2.126899 1.754578 -0.000118
C  -1.919716 -1.351923 0.000291
C  -2.481643 -0.003213 0.000159
H  -0.187359 -2.618222 0.000419
H  0.296473 2.960873 -0.000259
H  3.759113 0.292794 0.000054
H  2.803296 2.615057 -0.00023
H  -2.647172 -2.167474 0.000374
