program: Gaussian 09
title: 000230956
version: EM64L-G09RevD.01
frameworkgroup: C1[X(C14H11BrO2)]
method: RPBEPBE
basis: SDD
operation: Freq
keyword: #p
keyword: freq=noraman
keyword: PBEPBE/SDD
title: #p freq=noraman PBEPBE/SDD
converged: YES YES NO NO
title: Mulliken charges:
elementType: Br O O C C C C C C C C C C C C C C H H H H H H H H H H H
charge: 0.010069 -0.321075 -0.241777 0.360356 0.075474 -0.317450 -0.402690 -0.777536 0.152767 -0.233525 -0.215611 0.393616 -0.304856 -0.395114 -0.160990 -0.150177 -0.231167 0.269970 0.236598 0.248135 0.213542 0.248747 0.235034 0.233555 0.311133 0.257754 0.251599 0.253614
chargesum: 0.00000
title: Mulliken charges with hydrogens summed into heavy atoms:
elementType: Br O O C C C C C C C C C C C C C C
charge: 0.010069 -0.321075 -0.241777 0.360356 0.075474 -0.047480 -0.166092 -0.067111 0.152767 0.001509 0.017944 0.393616 0.006277 -0.137359 0.090609 0.103437 -0.231167
polarizability: 3.14431918e+02 -6.12335686e+00 1.73247066e+02 -2.24435357e-02 -6.04248148e-01 6.77826314e+01
1716.lowfreq: -8.9615 -1.8755 -0.3070 -0.0002 0.0001 0.0003 7.9323 26.5475 41.6250
frequency: 7.7354 26.5331 41.6203 65.4427 107.7361 145.4991 156.1356 186.9688 196.0728 231.0069 280.1962 320.5120 322.5824 356.0410 402.6392 410.9655 430.3736 447.3817 489.3671 504.0449 552.0338 605.9173 618.5261 664.8594 673.3341 700.4489 734.6810 763.7925 771.1027 788.9284 821.6052 834.1447 838.3847 883.6252 953.9212 971.7450 975.4008 990.2259 993.5452 997.5890 1002.4685 1044.5625 1051.9898 1059.6714 1107.7068 1132.9642 1154.3486 1178.7790 1193.9660 1207.0029 1226.7587 1284.9709 1287.1455 1363.9936 1374.0343 1393.7278 1404.6343 1426.3774 1456.4365 1460.4173 1468.1426 1475.6542 1573.3257 1574.9247 1593.2146 1608.3167 1626.7877 2991.9398 3076.8504 3092.0692 3127.9167 3143.6813 3159.8693 3160.9801 3166.0539 3180.1076 3189.5146 3218.0025
redmass: 3.6941 7.2926 8.5606 6.7474 6.1089 4.9453 9.9967 6.7919 1.1183 2.9288 4.9501 6.9036 7.0378 7.6701 4.2918 3.0041 3.2731 4.5911 3.2046 2.9034 6.0748 7.7640 7.3263 6.6870 4.8848 3.7669 1.8618 8.5326 6.0122 1.9115 1.3073 5.7190 1.4466 1.3061 1.3410 1.3857 1.3312 5.0095 2.1281 3.4017 1.3472 1.5826 2.2034 2.3168 1.3221 1.7412 2.0806 1.0662 1.6328 2.9700 3.1902 1.4503 1.2489 6.5460 5.5050 3.6712 1.2962 1.8905 1.0453 2.2947 1.2485 2.4130 6.6791 7.3557 6.8788 6.3182 9.8410 1.0364 1.0959 1.1013 1.0863 1.0913 1.0887 1.0974 1.0920 1.0975 1.0952 1.0942
irintensity: 0.0123 0.5393 1.0291 0.3618 0.0009 1.2260 0.1968 0.5904 1.1780 1.1217 5.7647 3.1286 2.7318 10.4095 1.4403 0.0844 0.3925 2.2291 11.3848 21.7391 0.1010 1.0974 0.0131 27.8635 13.5241 0.0723 48.0980 29.1766 1.1513 24.7883 15.4152 2.5625 75.0902 0.5339 1.7310 0.8993 1.8560 119.0328 206.7741 206.8993 0.0230 10.9279 6.7562 19.1606 13.4376 87.0977 273.2145 10.6763 263.9023 16.3684 248.4499 7.2765 5.2846 7.0908 9.9653 12.8261 18.1815 1.3705 12.7710 266.3892 24.0837 12.0682 26.0426 1.7006 0.2950 12.5105 169.1623 17.2696 9.3183 34.9942 3.6937 19.0122 4.6383 29.0860 3.1474 2.8049 7.7606 7.0504
temp: 298.150 k
press: 1.00000 atm
elementType: 35 8 8 6 6 6 6 6 6 6 6 6 6 6 6 6 6 1 1 1 1 1 1 1 1 1 1 1
symmnumber: 1
zpe: 547303.3 jmol-1
zpe.correction: 0.208457 hartree
zpe.thermalcorrener: 0.223700 hartree
zpe.thermalcorrenthalpy: 0.224644 hartree
zpe.thermalcorrgfe: 0.161994 hartree
zpe.sumelectzpe: -702.813753 hartree
zpe.sumelectthermal: -702.798510 hartree
zpe.sumelectthermalent: -702.797566 hartree
zpe.sumelectthermalfe: -702.860217 hartree
dipole: 3.3036 -1.5154 -0.0158
dipole: 3.6346
quadrupole: -96.1777 -98.2553 -113.2449
quadrupole: -2.0390 -0.0606 -0.2414
quadrupole: 6.3816 4.3040 -10.6856 -2.0390 -0.0606 -0.2414
hfenergy: -703.0222102 hartree
pointgroup: C01 [X(C14H11Br1O2)]
dipole: -1.3292409 0.3666946 0.3788135 debye
polarizability: 314.3801167|6.8360355|126.2827031|-5.4655015|52.1442034|114.7987955 unknown
InChI: InChI=1S/C14H11BrO2/c1-10-4-2-3-5-13(10)14(16)17-12-8-6-11(15)7-9-12/h2-9H,1H3
charge 0 multiplicity 1
28 atoms
Br 6.423194 0.35211 0.093605
O  0.24781 0.284517 0.349899
O  -0.360484 -1.422861 -1.144549
C  -3.207763 -0.856613 -0.503989
C  -2.085949 -0.152202 0.051507
C  -2.299067 0.912399 0.973849
C  -4.505141 -0.449529 -0.097837
C  -3.084262 -2.001474 -1.49176
C  -0.696847 -0.527025 -0.335139
C  -3.597429 1.293206 1.356296
C  -4.708734 0.606184 0.815743
C  1.659869 0.199211 0.204341
C  2.362062 -0.671391 -0.664409
C  2.355545 1.107939 1.035945
C  3.775244 -0.617395 -0.688864
C  3.76343 1.157947 1.008471
C  4.460869 0.290068 0.141268
H  -1.429187 1.431895 1.381082
H  -5.371206 -0.977687 -0.512737
H  -2.487383 -2.833831 -1.079619
H  -4.084689 -2.379887 -1.762963
H  -2.558388 -1.690835 -2.411454
H  -3.742919 2.114368 2.065772
H  -5.727254 0.890202 1.103245
H  1.826626 -1.373256 -1.302817
H  1.786777 1.768181 1.696992
H  4.327047 -1.285271 -1.356336
H  4.302331 1.860032 1.650359
