program: Gaussian 09
title: 000230955
version: EM64L-G09RevD.01
frameworkgroup: C1[X(C14H9Cl3O2)]
method: RPBEPBE
basis: SDD
operation: Freq
keyword: #p
keyword: freq=noraman
keyword: PBEPBE/SDD
title: #p freq=noraman PBEPBE/SDD
converged: YES YES NO NO
title: Mulliken charges:
elementType: Cl Cl Cl O O C C C C C C C C C C C C C C H H H H H H H H H
charge: -0.011739 0.004499 0.006134 -0.307397 -0.234093 0.075033 0.360669 -0.317242 -0.401802 0.161601 0.564482 -0.777388 -0.233764 -0.212880 -0.385599 -0.238552 -0.086320 -0.187003 -0.111594 0.285933 0.237950 0.248971 0.216524 0.248281 0.237970 0.234961 0.336876 0.285487
chargesum: 0.00000
title: Mulliken charges with hydrogens summed into heavy atoms:
elementType: Cl Cl Cl O O C C C C C C C C C C C C C C
charge: -0.011739 0.004499 0.006134 -0.307397 -0.234093 0.075033 0.360669 -0.031309 -0.163852 0.161601 0.564482 -0.063612 0.004206 0.022081 -0.385599 0.098324 -0.086320 0.098484 -0.111594
polarizability: 3.12633366e+02 1.73050840e+01 2.12172743e+02 2.01234632e-02 -5.39425593e-01 7.21544818e+01
1716.lowfreq: -7.2999 -3.3168 -1.1479 -0.0013 -0.0009 0.0003 12.0563 29.9676 42.1309
frequency: 11.6744 29.9357 42.1171 58.3632 78.9689 124.8591 149.7857 153.8460 163.9385 184.7246 190.3208 220.5814 228.0579 239.8860 308.3280 314.3944 359.7786 383.5404 400.7443 431.2757 443.6399 451.1202 488.2699 490.3391 528.2845 556.2941 608.5634 642.3251 666.7067 672.4045 696.2798 705.1268 735.9549 768.3143 790.8928 807.8905 853.5168 874.5060 886.3838 902.9450 976.9022 983.3335 997.4731 1006.4442 1033.8459 1045.0284 1051.8815 1108.1537 1132.5325 1180.5175 1199.5808 1212.7792 1226.9175 1240.0960 1287.6549 1324.1920 1364.1784 1374.6406 1405.9834 1427.1141 1440.2709 1457.5145 1469.5327 1475.9893 1551.8865 1572.5192 1580.6459 1608.9903 1634.1259 2991.9862 3075.2760 3093.1656 3128.8867 3144.7712 3161.5213 3182.1914 3182.6418 3207.1277
redmass: 5.7002 7.8599 9.1650 8.2254 15.5740 4.9732 10.6026 6.7195 9.6700 19.8665 1.1065 3.6729 10.6970 4.7934 9.2831 18.3415 11.2204 4.5518 9.4787 3.3413 3.2296 5.4486 3.2063 6.3563 8.8414 6.4365 10.8318 7.8404 6.9517 4.8797 3.8916 8.0429 1.9080 7.2137 1.8647 6.9462 1.4274 7.8482 1.3003 1.3778 1.3827 6.5575 1.6747 1.3501 6.8279 1.5834 2.2210 1.7265 1.7432 1.0759 3.7503 3.0778 2.5563 1.5490 1.4488 9.2262 10.5899 5.5108 1.3003 1.8749 3.1295 1.0451 1.2417 2.3739 9.1128 6.8192 8.5881 6.0563 10.3914 1.0366 1.0959 1.1013 1.0867 1.0913 1.0965 1.0931 1.0971 1.0927
irintensity: 0.2863 0.4123 0.7469 0.5051 0.0657 0.1120 0.2005 1.0685 0.6011 0.0081 1.1614 1.0664 0.3235 0.1595 4.7196 2.2316 0.6119 5.0873 7.9423 0.8194 13.0315 1.4791 7.5449 1.1111 24.4629 2.4443 0.2337 5.8268 43.2441 14.8896 0.2506 13.2023 46.7296 5.9644 28.4632 32.7347 10.1321 15.1304 0.2188 39.4546 0.7724 484.9984 15.7595 0.0329 212.5237 10.9292 3.4958 110.7747 53.9789 11.6390 300.8109 25.1775 246.9739 16.5636 7.3764 70.8291 0.6572 15.8734 15.0342 0.8997 390.9354 13.2506 35.2206 15.0157 3.2381 32.9795 0.0310 11.4834 172.3987 14.6970 9.0451 33.3133 4.1342 19.0943 20.9883 1.7143 13.0921 22.6479
temp: 298.150 k
press: 1.00000 atm
elementType: 17 17 17 8 8 6 6 6 6 6 6 6 6 6 6 6 6 6 6 1 1 1 1 1 1 1 1 1
symmnumber: 1
zpe: 497545.9 jmol-1
zpe.correction: 0.189505 hartree
zpe.thermalcorrener: 0.207151 hartree
zpe.thermalcorrenthalpy: 0.208095 hartree
zpe.thermalcorrgfe: 0.140752 hartree
zpe.sumelectzpe: -2068.182826 hartree
zpe.sumelectthermal: -2068.165180 hartree
zpe.sumelectthermalent: -2068.164236 hartree
zpe.sumelectthermalfe: -2068.231579 hartree
dipole: 3.8156 1.1629 -0.0135
dipole: 3.9889
quadrupole: -115.3524 -126.8277 -133.2718
quadrupole: -4.2321 -0.0468 -0.1777
quadrupole: 9.7982 -1.6771 -8.1212 -4.2321 -0.0468 -0.1777
hfenergy: -2068.3723309 hartree
pointgroup: C01 [X(C14H9Cl3O2)]
dipole: -1.4954366 0.0312521 0.4749883 debye
polarizability: 312.1807367|0.2289832|73.5974335|-18.6359058|14.0813719|211.1824201 unknown
InChI: InChI=1S/C14H9Cl3O2/c1-8-4-2-3-5-9(8)14(18)19-13-7-11(16)10(15)6-12(13)17/h2-7H,1H3
charge 0 multiplicity 1
28 atoms
Cl 1.13593 0.311773 3.088784
Cl 4.364194 -0.297275 -2.425971
Cl 5.973262 0.051435 0.42657
O  -0.06359 -0.01501 0.432054
O  -0.62623 -0.245601 -1.840785
C  -2.384591 -0.098177 -0.12963
C  -3.497345 -0.180354 -1.034752
C  -2.607152 0.017513 1.273833
C  -4.800125 -0.141999 -0.474875
C  -0.994601 -0.13313 -0.650503
C  1.33484 -0.01108 0.309128
C  -3.354896 -0.302924 -2.539768
C  -3.911746 0.051893 1.796194
C  -5.015152 -0.028484 0.915225
C  2.043105 0.138926 1.530889
C  2.06639 -0.143433 -0.896465
C  3.474728 -0.124555 -0.861658
C  3.446234 0.157229 1.560786
C  4.168525 0.024429 0.356368
H  -1.742636 0.079453 1.938969
H  -5.660885 -0.202905 -1.150403
H  -2.789908 -1.207961 -2.824327
H  -4.349623 -0.341139 -3.015418
H  -2.788778 0.543619 -2.966662
H  -4.068118 0.140294 2.876125
H  -6.037789 -0.002847 1.307936
H  1.537367 -0.257984 -1.842427
H  3.976491 0.273594 2.509082
