program: Gaussian 09
title: 000230953
version: EM64L-G09RevD.01
frameworkgroup: C1[X(C14H11ClO2)]
method: RPBEPBE
basis: SDD
operation: Freq
keyword: #p
keyword: freq=noraman
keyword: PBEPBE/SDD
title: #p freq=noraman PBEPBE/SDD
converged: YES YES NO NO
title: Mulliken charges:
elementType: Cl O O C C C C C C C C C C C C C C H H H H H H H H H H H
charge: -0.057101 -0.321134 -0.242501 0.360318 0.075223 -0.317583 -0.402726 -0.777491 0.152662 -0.233570 -0.215753 0.394446 -0.299297 -0.392461 -0.192145 -0.179723 -0.118132 0.269848 0.236514 0.248001 0.213395 0.248808 0.234929 0.233458 0.310325 0.256581 0.256708 0.258402
chargesum: 0.00000
title: Mulliken charges with hydrogens summed into heavy atoms:
elementType: Cl O O C C C C C C C C C C C C C C
charge: -0.057101 -0.321134 -0.242501 0.360318 0.075223 -0.047735 -0.166212 -0.067288 0.152662 0.001359 0.017705 0.394446 0.011028 -0.135880 0.064563 0.078679 -0.118132
polarizability: 2.91350635e+02 -5.50656437e+00 1.71978905e+02 8.61137901e-02 -4.92183990e-01 6.69298230e+01
1716.lowfreq: -13.0472 -4.7499 -0.0027 -0.0024 -0.0019 1.1878 4.2727 28.9171 43.4782
frequency: -8.2783 28.9038 43.4660 72.5392 114.0215 151.1187 179.8213 195.8805 210.6768 231.5370 292.7964 330.9301 349.7713 378.7417 411.5789 412.4674 430.5612 459.0255 489.3464 500.8342 552.0340 615.5178 628.7323 666.8795 673.3817 698.1037 734.7061 766.9080 771.8098 788.9268 818.5090 834.5928 835.4867 883.5675 948.7704 970.5932 971.6463 993.7545 994.8805 998.5264 1002.3742 1044.5200 1052.0056 1071.3767 1106.0273 1133.1000 1154.2322 1178.7027 1191.4435 1206.9652 1226.8419 1284.9177 1286.1535 1368.1860 1374.1544 1397.4777 1404.5836 1426.3006 1456.2603 1464.2556 1468.1963 1475.8997 1573.4403 1580.5529 1597.9838 1608.1777 1626.1987 2991.9541 3076.9087 3092.0983 3127.8489 3143.6027 3160.7183 3160.9225 3168.3535 3180.9834 3189.3904 3218.8535
redmass: 3.6941 7.1263 9.4767 6.6010 5.5436 5.4528 8.5924 1.1152 6.2452 2.9871 5.6762 7.1478 7.3302 4.7696 6.3665 3.0278 3.2750 4.8503 3.1977 2.8869 6.0748 7.3231 7.7827 6.7224 4.8847 3.7856 1.8590 9.0755 5.7368 1.9144 1.3035 4.7519 1.5334 1.3062 1.3416 1.3264 1.3858 2.4569 2.5342 5.0579 1.3471 1.5827 2.2022 2.4387 1.3015 1.7341 1.9439 1.0674 1.7626 2.9757 3.2135 1.4490 1.2549 6.8392 5.5539 3.7085 1.2962 1.8900 1.0455 2.2994 1.2547 2.4321 6.6965 7.3767 6.9806 6.3412 9.7609 1.0364 1.0959 1.1013 1.0863 1.0913 1.0893 1.0968 1.0919 1.0976 1.0952 1.0943
irintensity: 0.0175 0.6669 0.9096 0.3071 0.0018 1.8970 0.3125 0.9998 0.8076 0.8980 6.4980 1.4262 0.4457 10.5620 6.1909 0.1251 0.4555 6.9006 12.3031 19.1931 0.0949 0.6348 0.5337 27.9939 13.4333 0.2689 48.3612 24.1039 2.2186 24.4113 14.6242 8.0451 74.1823 0.5245 1.5311 1.6595 0.9014 9.0924 163.1457 320.6126 0.0282 10.9497 6.8324 46.3581 15.8159 75.0970 216.3953 12.6449 253.8363 20.4665 255.1947 7.4205 5.4701 7.8603 9.1225 10.1974 18.3390 1.3551 12.7515 266.8563 14.5062 14.6595 24.9142 3.0430 0.9733 12.8402 166.7483 17.3210 9.3430 34.2911 3.6542 18.9526 10.3528 22.7219 2.2654 2.1224 7.7155 6.2171
temp: 298.150 k
press: 1.00000 atm
elementType: 17 8 8 6 6 6 6 6 6 6 6 6 6 6 6 6 6 1 1 1 1 1 1 1 1 1 1 1
symmnumber: 1
zpe: 548507.6 jmol-1
zpe.correction: 0.208916 hartree
zpe.thermalcorrener: 0.222998 hartree
zpe.thermalcorrenthalpy: 0.223942 hartree
zpe.thermalcorrgfe: 0.166635 hartree
zpe.sumelectzpe: -1149.414459 hartree
zpe.sumelectthermal: -1149.400377 hartree
zpe.sumelectthermalent: -1149.399433 hartree
zpe.sumelectthermalfe: -1149.456740 hartree
dipole: 3.3003 -1.5272 -0.0028
dipole: 3.6365
quadrupole: -100.0384 -95.4881 -110.2978
quadrupole: -0.8182 -0.0277 -0.1458
quadrupole: 1.9030 6.4534 -8.3564 -0.8182 -0.0277 -0.1458
hfenergy: -1149.623375 hartree
pointgroup: C01 [X(C14H11Cl1O2)]
dipole: -1.3280943 0.3666086 0.3856783 debye
polarizability: 291.3204649|5.9372206|125.1796025|-5.2620884|51.9522737|113.7592957 unknown
InChI: InChI=1S/C14H11ClO2/c1-10-4-2-3-5-13(10)14(16)17-12-8-6-11(15)7-9-12/h2-9H,1H3
charge 0 multiplicity 1
28 atoms
Cl 6.287074 0.34623 0.096889
O  0.256989 0.282225 0.350391
O  -0.353463 -1.41418 -1.155228
C  -3.199278 -0.855225 -0.50358
C  -2.077018 -0.150754 0.050859
C  -2.28947 0.912233 0.975199
C  -4.496273 -0.449936 -0.094426
C  -3.076664 -1.998554 -1.493292
C  -0.688121 -0.523435 -0.339173
C  -3.587458 1.291464 1.360532
C  -4.69916 0.604317 0.820999
C  1.669509 0.198043 0.202841
C  2.371376 -0.676467 -0.663017
C  2.364388 1.110836 1.031406
C  3.784319 -0.622256 -0.687454
C  3.772098 1.161071 1.003818
C  4.464511 0.289048 0.139838
H  -1.419285 1.431779 1.38174
H  -5.362645 -0.978328 -0.50839
H  -2.474029 -2.828926 -1.085631
H  -4.077077 -2.380593 -1.759434
H  -2.557144 -1.684516 -2.415455
H  -3.732311 2.111481 2.071468
H  -5.717424 0.887006 1.110718
H  1.835121 -1.380166 -1.298587
H  1.794688 1.773011 1.68962
H  4.341559 -1.290547 -1.350057
H  4.316089 1.863742 1.640809
