program: Gaussian 09
title: 000230952
version: EM64L-G09RevD.01
frameworkgroup: C1[X(C13H21NO4)]
method: RPBEPBE
basis: SDD
operation: Freq
keyword: #p
keyword: freq=noraman
keyword: PBEPBE/SDD
title: #p freq=noraman PBEPBE/SDD
converged: YES YES NO NO
title: Mulliken charges:
elementType: O O O O N C C C C C C C C C C C C C H H H H H H H H H H H H H H H H H H H H H
charge: -0.229688 -0.228772 -0.207212 -0.189397 0.112018 -0.146422 -0.052177 -0.045256 0.303224 -0.482840 -0.469620 -0.382234 -0.399752 -0.411143 -0.779180 -0.208364 -0.211951 -0.701949 0.236201 0.252633 0.221457 0.235627 0.245912 0.208585 0.204535 0.276713 0.184506 0.187082 0.276925 0.239511 0.210706 0.223306 0.217942 0.208542 0.202509 0.200315 0.242952 0.226854 0.227901
chargesum: 0.00000
title: Mulliken charges with hydrogens summed into heavy atoms:
elementType: O O O O N C C C C C C C C C C C C C
charge: -0.229688 -0.228772 -0.207212 -0.189397 0.112018 0.089779 0.200456 0.176201 0.303224 -0.001302 -0.056500 0.078986 0.064255 0.039074 -0.129391 -0.005855 -0.011636 -0.004241
polarizability: 1.85661851e+02 -2.69287987e+00 1.49747593e+02 5.55465796e+00 -1.53517384e+00 1.28654536e+02
1716.lowfreq: -10.1218 -7.7824 0.0002 0.0005 0.0006 8.0586 36.4713 40.0217 55.2948
frequency: 35.7752 39.9748 55.2632 62.3445 79.6720 107.4159 132.4935 152.2520 172.3115 178.0221 213.3332 218.2189 229.9646 268.0266 298.7532 322.9447 344.1440 362.4388 374.1492 383.1134 393.2139 444.4148 459.4688 476.2659 496.9465 520.7110 542.3323 598.2167 650.3183 672.3116 689.5497 761.6916 765.3686 772.5256 780.8273 844.7577 869.5080 880.4388 890.5860 908.2081 919.1603 939.6355 952.7125 959.4940 969.1074 975.3943 1013.7674 1019.2359 1053.0359 1055.5519 1071.6489 1085.2812 1094.3971 1102.9555 1121.6359 1132.7067 1143.4286 1171.2833 1198.5458 1204.9643 1219.9655 1227.6154 1239.8449 1258.3006 1282.3984 1292.6405 1298.7885 1307.0721 1322.3905 1325.7120 1336.2292 1344.9905 1351.4685 1360.4002 1365.5737 1374.3901 1379.6639 1381.6881 1403.0745 1411.5818 1438.7637 1444.6783 1456.2649 1463.5561 1464.9766 1473.0730 1483.7155 1485.6448 1486.7498 1679.1014 2898.2388 2937.2819 2938.2768 2947.0594 2965.3069 2971.8255 2982.7822 2988.3627 2990.8948 2993.9139 3007.6677 3038.9762 3045.9371 3058.2559 3069.1632 3088.4121 3092.0979 3093.7882 3110.1880 3122.7949 3124.6662
redmass: 4.3133 4.7252 9.1723 2.8529 2.9686 3.7069 2.6373 3.3030 7.2230 2.1044 1.8828 2.1101 1.8894 1.7734 2.3931 2.6517 2.8180 2.7948 2.3828 2.2107 3.3687 3.3302 4.0421 4.0790 4.1188 4.7186 5.5473 7.1544 2.3721 1.6904 2.8332 2.8819 9.7205 1.9076 1.9999 2.7589 2.9115 2.3843 2.7263 1.7571 2.0355 1.6866 2.1658 2.3160 5.6168 1.2774 1.8778 2.3563 2.3666 2.0088 2.8968 2.6258 2.0355 3.0891 1.8104 1.3915 2.2316 1.4924 2.3259 1.2027 4.7629 1.6097 1.2198 1.2521 1.2510 1.4010 1.3331 1.2680 1.2640 1.4478 1.2696 1.5073 1.4828 1.4476 1.5322 1.3182 1.6322 1.2188 2.3173 1.6282 1.1781 1.0857 1.0895 1.0860 1.1053 1.0570 1.0593 1.0419 1.0463 6.4334 1.0825 1.0647 1.0694 1.0699 1.0374 1.0806 1.0648 1.0869 1.0592 1.0373 1.0904 1.0972 1.1013 1.0979 1.0988 1.0994 1.0837 1.1007 1.0937 1.0927 1.0994
irintensity: 0.9246 1.5812 0.0214 0.5976 0.2111 0.2860 0.4992 0.9487 2.0749 1.2651 0.5824 1.7188 0.3990 1.9012 1.1742 0.9844 1.0659 5.5061 7.0705 0.5021 3.3825 0.2618 0.4723 1.9202 1.8087 3.6757 9.6763 8.5559 10.5144 32.2582 20.8568 2.9626 18.0283 21.1708 0.9081 26.4428 9.1056 43.1303 11.6266 0.2379 7.3948 2.9509 7.4657 50.1266 18.4812 1.5351 13.9833 46.8630 11.3399 3.6254 85.2005 18.5388 20.2504 14.3042 10.2308 21.2717 12.0648 8.4000 7.9810 3.1703 47.6145 8.6054 1.0718 14.5800 1.5880 2.3345 8.3347 3.3544 3.8282 1.0665 2.5991 7.5475 5.1236 17.1455 3.6875 4.1440 1.8966 14.0674 133.4196 29.2152 4.4614 7.3969 5.3270 18.3860 9.2309 6.7786 16.0162 13.4207 13.3844 5.3998 52.6520 40.4708 11.2081 92.1001 37.2877 8.5903 8.6226 25.3207 29.9704 16.7896 32.2556 14.7462 5.7220 52.2537 49.7040 32.1014 7.9947 28.5467 4.0892 5.0974 73.6947
temp: 298.150 k
press: 1.00000 atm
elementType: 8 8 8 8 7 6 6 6 6 6 6 6 6 6 6 6 6 6 1 1 1 1 1 1 1 1 1 1 1 1 1 1 1 1 1 1 1 1 1
symmnumber: 1
zpe: 858071.9 jmol-1
zpe.correction: 0.326822 hartree
zpe.thermalcorrener: 0.345031 hartree
zpe.thermalcorrenthalpy: 0.345975 hartree
zpe.thermalcorrgfe: 0.280329 hartree
zpe.sumelectzpe: -862.093610 hartree
zpe.sumelectthermal: -862.075401 hartree
zpe.sumelectthermalent: -862.074457 hartree
zpe.sumelectthermalfe: -862.140103 hartree
dipole: 1.2658 5.2647 1.5709
dipole: 5.6380
quadrupole: -99.7700 -111.1815 -112.2740
quadrupole: 10.7066 3.0771 0.5239
quadrupole: 7.9719 -3.4397 -4.5322 10.7066 3.0771 0.5239
hfenergy: -862.4204325 hartree
pointgroup: C01 [X(C13H21N1O4)]
dipole: -0.515958 -2.0907906 0.5316377 debye
polarizability: 185.8949769|-2.6299683|149.6235393|-4.2277634|2.2266206|128.5454636 unknown
InChI: InChI=1S/C13H21NO4/c1-3-13(14(15)16)8-17-12(18-9-13)11-7-5-4-6-10(11)2/h4-5,10-12H,3,6-9H2,1-2H3
charge 0 multiplicity 1
39 atoms
O  -0.294576 0.260895 1.449438
O  -0.056241 -0.576424 -0.793321
O  -3.085735 1.985485 0.475062
O  -2.413042 1.393612 -1.613948
N  -2.612654 1.14232 -0.372627
C  1.932469 -0.09577 0.538406
C  2.861618 -0.962712 -0.36416
C  0.491714 -0.609289 0.565058
C  -2.359781 -0.309637 0.152621
C  1.982252 1.394776 0.108712
C  4.3269 -0.478267 -0.197974
C  -1.677136 -0.211402 1.54167
C  -1.438843 -1.066706 -0.829608
C  -3.761346 -0.97074 0.294289
C  2.764754 -2.479094 -0.082241
C  3.402841 1.87229 -0.111932
C  4.464381 1.032611 -0.230625
C  -4.575996 -1.082279 -1.012443
H  2.301904 -0.173412 1.582944
H  2.554645 -0.782694 -1.413707
H  0.409604 -1.653394 0.953042
H  1.488182 2.015446 0.87926
H  1.384338 1.528817 -0.815384
H  4.947783 -0.925513 -1.001207
H  4.742956 -0.873929 0.755355
H  -2.205457 0.508431 2.183567
H  -1.707519 -1.224391 2.001843
H  -1.472101 -2.144243 -0.552191
H  -1.764155 -0.938946 -1.87065
H  -4.333816 -0.393502 1.045081
H  -3.601774 -1.981383 0.718193
H  1.786878 -2.893821 -0.386715
H  3.54274 -3.024796 -0.64845
H  2.919599 -2.700001 0.99243
H  3.559228 2.958554 -0.170713
H  5.474457 1.444448 -0.364633
H  -4.765584 -0.093654 -1.465929
H  -4.0677 -1.709467 -1.7660
H  -5.555487 -1.545914 -0.800711
