program: Gaussian 09
title: 000230951
version: EM64L-G09RevD.01
frameworkgroup: C1[X(C14H11ClO2)]
method: RPBEPBE
basis: SDD
operation: Freq
keyword: #p
keyword: freq=noraman
keyword: PBEPBE/SDD
title: #p freq=noraman PBEPBE/SDD
converged: YES YES NO NO
title: Mulliken charges:
elementType: Cl O O C C C C C C C C C C C C C C H H H H H H H H H H H
charge: -0.039203 -0.310628 -0.238849 0.360584 0.070953 -0.319534 -0.403799 -0.778834 0.158926 -0.235017 -0.215329 0.521730 -0.342093 -0.301352 -0.211292 -0.219208 -0.236712 0.288933 0.235640 0.247588 0.213704 0.247830 0.236055 0.232568 0.309813 0.257169 0.234271 0.236087
chargesum: 0.00000
title: Mulliken charges with hydrogens summed into heavy atoms:
elementType: Cl O O C C C C C C C C C C C C C C
charge: -0.039203 -0.310628 -0.238849 0.360584 0.070953 -0.030601 -0.168159 -0.069713 0.158926 0.001038 0.017239 0.521730 -0.342093 0.008462 0.045877 0.015063 -0.000625
polarizability: 2.55758730e+02 1.72306591e+01 1.93112077e+02 1.52527900e-01 -5.29240550e-02 6.69967036e+01
1716.lowfreq: -3.9031 -2.8288 0.0013 0.0026 0.0028 2.2857 14.8226 33.2317 50.7680
frequency: 14.2942 33.2021 50.7633 72.9549 125.8839 155.7035 170.0990 185.4885 211.6807 225.9540 273.8778 296.8142 361.5477 390.8542 417.9111 430.6686 439.7947 455.7896 488.3698 537.6714 553.2383 574.3813 655.5269 671.8750 672.9662 714.4945 736.5467 757.6555 761.7746 774.9290 790.1778 841.5546 868.9242 885.7073 949.7666 975.9071 988.9774 991.0104 996.0102 1005.9936 1017.0571 1042.2664 1043.7478 1052.8227 1128.0413 1132.9979 1169.4236 1179.9111 1199.3036 1211.0894 1229.3567 1261.2562 1288.4722 1370.6366 1374.3137 1404.7288 1425.8514 1427.3868 1456.0693 1456.4193 1468.4930 1477.0808 1571.5065 1574.1003 1598.6356 1608.2937 1627.8790 2991.6255 3075.5602 3092.3374 3125.9655 3142.4373 3142.8921 3159.5873 3160.1496 3176.5692 3182.6207 3211.0907
redmass: 5.6048 5.7125 6.8631 7.1322 4.1233 5.0779 7.6381 1.0981 6.2272 3.2014 5.5584 6.0930 6.9987 8.9540 3.9335 3.2854 3.3584 6.1410 3.2089 3.9514 6.1273 7.5728 6.8136 6.7912 4.8625 4.5322 1.8979 9.4126 1.2189 5.4899 1.8771 5.9977 1.3394 1.3023 1.3546 1.3819 1.3092 3.6875 2.0224 1.3485 6.9924 2.1058 1.5841 2.2224 1.5940 1.7643 1.1489 1.0809 2.9435 2.8417 3.0020 1.4509 1.4376 8.8396 5.7945 1.2922 2.0235 2.0754 1.0598 2.4449 1.2310 2.4272 6.4592 6.6659 7.2430 6.1511 9.9698 1.0365 1.0959 1.1013 1.0867 1.0912 1.0866 1.0924 1.0967 1.0988 1.0966 1.0944
irintensity: 0.8430 1.9171 0.0936 1.7081 0.4303 1.5962 0.5191 0.7594 0.2474 0.5089 0.7875 6.2955 4.6855 0.6651 0.3107 0.6710 8.1903 3.7046 6.8310 0.0267 0.2739 9.4463 14.9384 17.9716 12.4527 0.0255 46.7384 5.8310 102.1149 1.6231 29.9487 6.7644 2.4100 0.5645 5.0302 0.8060 1.6875 296.1444 65.5677 0.0569 49.2951 106.5725 11.0296 4.5138 16.3501 69.3272 41.2683 11.7419 488.2286 26.0994 129.2725 4.9480 8.4245 13.4735 9.4839 17.1455 15.4379 12.9186 16.7956 159.2911 33.7909 16.1454 12.7904 27.3993 6.9099 10.8229 171.7361 17.1688 9.9006 32.7157 5.4041 20.8019 2.7760 13.4803 21.9487 12.9436 12.7528 6.9847
temp: 298.150 k
press: 1.00000 atm
elementType: 17 8 8 6 6 6 6 6 6 6 6 6 6 6 6 6 6 1 1 1 1 1 1 1 1 1 1 1
symmnumber: 1
zpe: 548874.9 jmol-1
zpe.correction: 0.209055 hartree
zpe.thermalcorrener: 0.224023 hartree
zpe.thermalcorrenthalpy: 0.224967 hartree
zpe.thermalcorrgfe: 0.164571 hartree
zpe.sumelectzpe: -1149.411522 hartree
zpe.sumelectthermal: -1149.396555 hartree
zpe.sumelectthermalent: -1149.395610 hartree
zpe.sumelectthermalfe: -1149.456007 hartree
dipole: 0.4599 -0.1315 -0.0098
dipole: 0.4784
quadrupole: -79.4092 -101.3377 -110.3391
quadrupole: 5.2445 0.0511 -0.0552
quadrupole: 17.6195 -4.3090 -13.3105 5.2445 0.0511 -0.0552
hfenergy: -1149.6205775 hartree
pointgroup: C01 [X(C14H11Cl1O2)]
dipole: -0.1711032 -0.0494663 -0.0608924 debye
polarizability: 258.2543302|9.2132937|92.1426116|-13.3859613|48.4406713|165.4705682 unknown
InChI: InChI=1S/C14H11ClO2/c1-10-6-2-3-7-11(10)14(16)17-13-9-5-4-8-12(13)15/h2-9H,1H3
charge 0 multiplicity 1
28 atoms
Cl 1.809065 1.50852 2.551383
O  0.53021 0.226523 0.249519
O  -0.132075 -0.836495 -1.741736
C  -2.952173 -0.596387 -0.813182
C  -1.803643 -0.139869 -0.08145
C  -1.964607 0.478396 1.19262
C  -4.226136 -0.406448 -0.218379
C  -2.878757 -1.263162 -2.174049
C  -0.437444 -0.309276 -0.647282
C  -3.241925 0.651564 1.754512
C  -4.380078 0.205692 1.043726
C  1.926312 0.241297 0.046923
C  2.67177 0.838452 1.096838
C  2.61567 -0.274883 -1.079744
C  4.073086 0.92623 1.041355
C  4.024413 -0.185471 -1.134015
C  4.756274 0.409755 -0.08371
H  -1.07354 0.816489 1.726962
H  -5.113382 -0.748365 -0.763478
H  -2.278824 -2.189741 -2.14227
H  -3.892918 -1.508296 -2.533243
H  -2.382208 -0.617117 -2.918913
H  -3.349921 1.128271 2.734239
H  -5.381984 0.333826 1.468784
H  2.048272 -0.733782 -1.889159
H  4.617876 1.391855 1.867759
H  4.546695 -0.587394 -2.008392
H  5.84777 0.475815 -0.131117
