program: Gaussian 09
title: 000230950
version: EM64L-G09RevD.01
frameworkgroup: C1[X(C13H16O4)]
method: RPBEPBE
basis: SDD
operation: Freq
keyword: #pfreq=noraman
keyword: PBEPBE/SDD
title: #p freq=noraman PBEPBE/SDD
converged: YES YES NO NO
title: Mulliken charges:
elementType: O O O O C C C C C C C C C C C C C H H H H H H H H H H H H H H H H
charge: -0.270815 -0.244413 -0.259202 -0.240023 -0.069997 -0.156047 -0.343926 -0.354019 0.345595 -0.368346 -0.374419 0.440774 -0.405151 -0.353538 -0.805155 0.292930 -0.747166 0.265664 0.258597 0.235589 0.226083 0.248414 0.259081 0.262559 0.258773 0.231502 0.231853 0.234980 0.224874 0.228584 0.247509 0.246911 0.251944
chargesum: 0.00000
title: Mulliken charges with hydrogens summed into heavy atoms:
elementType: O O O O C C C C C C C C C C C C C
charge: -0.270815 -0.244413 -0.259202 -0.240023 0.195667 0.102549 0.117746 0.153477 0.345595 -0.105787 -0.115647 0.440774 -0.173649 -0.121685 -0.116717 0.292930 -0.000801
polarizability: 1.80295651e+02 1.93573854e+01 1.31746559e+02 7.32125484e+00 -4.88733875e+00 1.32371418e+02
1716.lowfreq: -16.1451 -7.1265 -0.0002 0.0003 0.0005 4.3697 6.6092 9.4013 20.1302
frequency: -15.3259 6.9519 18.3026 28.3409 40.7552 50.7089 78.5162 81.8894 136.2887 174.8144 212.0852 264.5369 286.0266 309.7331 327.1201 335.0751 408.1708 430.4301 443.8976 463.9058 480.1022 559.5263 567.5490 620.6030 634.4065 648.1244 699.3491 712.8176 776.2849 778.4040 808.3085 832.1839 857.1245 866.2014 874.9115 909.4136 918.0492 946.8124 971.2447 979.0314 987.0673 989.3916 999.5782 1013.7718 1025.6570 1042.3150 1048.2853 1106.3171 1120.4845 1121.5985 1181.6170 1185.0559 1195.2714 1209.9123 1221.8449 1232.4802 1247.4944 1281.7644 1291.8856 1304.0943 1317.0498 1344.8416 1367.2200 1370.6944 1383.9746 1398.2409 1402.8243 1451.2298 1452.9778 1454.7269 1470.6875 1474.0719 1475.3558 1503.9262 1583.0034 1623.8879 1657.3777 2976.7352 2997.1894 3007.9855 3042.3844 3048.0084 3052.4056 3055.7811 3084.6249 3097.9087 3116.2529 3119.3578 3123.3745 3126.9303 3143.3060 3149.7001 3154.1372
redmass: 1.0959 1.0307 5.0132 5.1682 4.1543 4.4868 3.6075 3.5121 3.6360 4.5484 5.8206 3.7529 3.5858 5.4719 2.9920 5.0836 2.9090 2.5344 3.4934 3.9613 3.2230 4.6105 3.2274 4.7161 6.7699 4.7333 5.1671 4.4719 4.1409 3.2735 2.0072 3.2090 2.5355 1.5554 2.9396 5.0950 1.9239 4.4678 1.4117 3.0212 1.4389 1.3767 2.1638 3.5278 4.1280 1.6680 1.5612 2.3457 1.2990 2.3916 1.2569 1.1690 3.1830 2.8985 2.5128 1.1996 1.2447 1.1825 1.2652 1.2683 1.2420 1.3082 1.4442 4.0344 1.2467 1.2729 3.0776 1.0959 1.0548 1.0515 1.0519 1.0935 1.0916 2.6959 6.2999 6.3571 9.0553 1.0375 1.0667 1.0375 1.0624 1.0815 1.0880 1.0970 1.0990 1.0960 1.1010 1.0886 1.0886 1.1087 1.1015 1.0945 1.0960
irintensity: 1.2777 0.4599 0.0330 0.7667 1.1623 0.6379 0.6546 0.4863 3.3671 1.6156 7.1448 1.3918 18.3154 6.6331 0.3136 4.3903 0.0271 7.5102 6.7102 18.0229 9.0104 8.7775 5.8886 4.5505 0.3653 8.4006 1.8817 1.3078 23.8170 19.4423 42.1517 13.7330 37.1181 12.0327 42.0207 10.8473 26.8432 56.8320 36.4102 21.1311 4.5844 2.0931 123.1956 45.7821 83.4426 11.1617 12.9157 6.3601 6.9630 0.3238 40.0285 15.2084 294.4137 26.0815 0.0448 9.7210 28.7140 5.8116 45.3764 1.8450 1.5856 2.0219 5.8869 0.1401 57.4171 11.1030 3.6860 15.4874 19.7901 23.3797 13.6259 12.5360 6.6556 15.4647 0.0732 9.9530 187.2800 34.6498 34.4911 2.1014 5.9373 32.4386 16.6749 21.2268 18.5009 7.3277 21.4564 14.5286 16.9470 13.4167 9.9435 17.1160 1.2374
temp: 298.150 k
press: 1.00000 atm
elementType: 8 8 8 8 6 6 6 6 6 6 6 6 6 6 6 6 6 1 1 1 1 1 1 1 1 1 1 1 1 1 1 1 1
symmnumber: 1
zpe: 696059.5 jmol-1
zpe.correction: 0.265115 hartree
zpe.thermalcorrener: 0.281434 hartree
zpe.thermalcorrenthalpy: 0.282378 hartree
zpe.thermalcorrgfe: 0.216119 hartree
zpe.sumelectzpe: -804.584407 hartree
zpe.sumelectthermal: -804.568088 hartree
zpe.sumelectthermalent: -804.567144 hartree
zpe.sumelectthermalfe: -804.633402 hartree
dipole: -1.0949 -2.5415 -2.3440
dipole: 3.6266
quadrupole: -92.9603 -100.0990 -100.6235
quadrupole: 1.3527 -10.7930 -0.7404
quadrupole: 4.9340 -2.2048 -2.7292 1.3527 -10.7930 -0.7404
hfenergy: -804.8495218 hartree
pointgroup: C01 [X(C13H16O4)]
dipole: -0.3232276 0.6088159 1.2492589 debye
polarizability: 177.0443846|-16.9241514|136.1277592|-17.4386671|-2.1661193|131.2414833 unknown
InChI: InChI=1S/C13H16O4/c1-9-3-5-11(6-4-9)13-16-8-12(17-13)7-15-10(2)14/h3-6,12-13H,7-8H2,1-2H3
charge 0 multiplicity 1
33 atoms
O  0.351289 -0.989537 -1.968799
O  -0.11512 -2.574945 -0.311682
O  2.820294 0.653378 0.369896
O  4.396799 0.782732 -1.349652
C  1.480494 -0.915562 -0.996722
C  -0.758709 -1.685243 -1.278932
C  1.022332 -1.783416 0.213257
C  1.727685 0.55877 -0.64269
C  -1.732097 -0.705244 -0.62423
C  -2.422363 -1.065142 0.557237
C  -2.000395 0.551209 -1.221691
C  -3.631181 1.08433 0.549299
C  -3.355514 -0.176292 1.136745
C  -2.93591 1.432072 -0.639423
C  -4.647263 2.033021 1.161701
C  4.130263 0.772878 -0.128404
C  5.112385 0.909285 1.013707
H  2.364164 -1.337281 -1.505512
H  -1.246226 -2.329813 -2.02996
H  1.779458 -2.503805 0.553428
H  0.693954 -1.147247 1.057756
H  0.848472 1.001827 -0.149578
H  2.007869 1.130351 -1.543324
H  -2.214343 -2.035773 1.020539
H  -1.464896 0.833862 -2.134822
H  -3.876753 -0.465596 2.057393
H  -3.129708 2.403478 -1.111349
H  -5.54913 2.116771 0.525433
H  -4.973515 1.688782 2.158182
H  -4.233288 3.052159 1.272647
H  6.138153 0.784183 0.638063
H  4.898656 0.168558 1.801553
H  5.015246 1.911654 1.468236
