program: Gaussian 09
title: 000230948
version: EM64L-G09RevD.01
frameworkgroup: C1[X(C11H18O4)]
method: RPBEPBE
basis: SDD
operation: Freq
keyword: #pfreq=noraman
keyword: PBEPBE/SDD
title: #p freq=noraman PBEPBE/SDD
converged: YES YES NO NO
title: Mulliken charges:
elementType: O O O O C C C C C C C C C C C H H H H H H H H H H H H H H H H H H
charge: -0.310052 -0.269322 -0.263090 -0.240916 0.358617 -0.441056 -0.462079 -0.385394 -0.387872 -0.390860 -0.072084 -0.375068 -0.336709 0.302576 -0.755335 0.205641 0.212089 0.213349 0.213051 0.196189 0.221717 0.221235 0.197892 0.188772 0.204431 0.259109 0.245441 0.206698 0.258161 0.235198 0.252211 0.246539 0.250920
chargesum: 0.00000
title: Mulliken charges with hydrogens summed into heavy atoms:
elementType: O O O O C C C C C C C C C C C
charge: -0.310052 -0.269322 -0.263090 -0.240916 0.358617 -0.023327 -0.035679 0.032513 0.031255 0.002344 0.187024 0.077071 0.156651 0.302576 -0.005665
polarizability: 1.63873409e+02 5.63714124e+00 1.10953891e+02 -3.79564767e+00 1.05604384e+00 1.08284166e+02
1716.lowfreq: -33.9377 -25.1598 -5.1323 0.0005 0.0006 0.0010 3.4309 31.1145 34.0630
frequency: -25.1567 30.6737 33.7880 43.9303 84.1862 98.4976 128.8838 175.6198 231.5190 245.1893 277.3138 298.5365 321.3074 354.3940 408.8550 415.1813 432.6673 450.6931 470.3298 511.1587 577.8515 612.0616 645.4786 695.8076 714.2361 776.8049 782.0649 796.6309 837.0064 850.8443 874.8448 904.2988 913.9802 927.5368 928.0145 947.9704 973.3009 992.3177 1001.9103 1040.2070 1046.4675 1052.4490 1069.4824 1086.3120 1095.1139 1121.5976 1139.8978 1149.5350 1186.6067 1193.5200 1227.5883 1238.8349 1244.9750 1266.1859 1271.4668 1279.5343 1318.1125 1323.2548 1333.2537 1336.4181 1339.8422 1341.7108 1358.5698 1370.2098 1384.4254 1444.1935 1446.9431 1456.2182 1456.6572 1458.1032 1463.4946 1467.6196 1475.9352 1476.7626 1649.6389 2966.2906 2984.9534 2987.0823 2990.1147 2994.6807 2995.6663 3009.2373 3034.3223 3042.8750 3043.7359 3049.3363 3053.6310 3057.2923 3065.9099 3097.2603 3104.5044 3127.3612 3140.4176
redmass: 1.0718 4.1760 5.4777 4.7853 3.7361 3.3847 3.6204 2.7697 2.6116 3.7993 2.8502 2.8567 2.7958 2.9837 2.1804 2.3588 3.0380 3.5378 3.7282 1.9330 3.2883 4.0282 4.4372 4.1749 6.4357 1.4735 4.5580 2.3959 2.5424 3.0522 1.7451 2.2552 2.1641 2.0531 2.1333 6.1182 3.4104 2.6930 2.0263 2.1496 1.6283 2.0286 1.2516 2.2036 1.5227 1.9242 1.6925 2.3840 2.2082 1.5514 1.4969 1.4417 1.3640 1.3010 1.3511 1.4115 1.5203 1.3505 1.3543 1.3757 1.4835 1.4551 1.4959 1.3722 1.2266 1.0898 1.0894 1.0755 1.0939 1.0461 1.0841 1.0842 1.0890 1.0872 9.9445 1.0634 1.0592 1.0609 1.0625 1.0654 1.0635 1.0365 1.0959 1.0992 1.0602 1.1015 1.0858 1.1024 1.1022 1.0970 1.1002 1.1099 1.1013
irintensity: 1.4889 0.6030 1.6918 2.7909 0.2944 0.0634 0.7148 0.4358 1.3562 15.1521 11.6077 12.0872 0.4950 0.3094 6.3521 6.1735 4.0624 6.1128 8.0663 4.7744 5.5435 2.7582 6.9557 9.0233 4.2602 2.7615 21.9381 25.6940 9.5205 5.4213 42.5503 3.1646 12.2368 21.2716 14.6006 87.1774 39.1651 10.8211 86.9242 5.7214 10.6510 38.0535 2.2949 110.7177 6.5786 0.8093 4.8467 51.5937 304.2186 50.9470 14.6855 8.6762 2.3140 8.4482 21.6705 3.3268 5.8877 5.3695 1.0353 1.7187 2.3640 0.4470 22.1881 1.3644 55.0920 18.6803 4.7053 5.3842 16.6685 17.7909 11.5115 15.4387 5.8170 9.7197 177.5599 40.0068 9.4486 29.6150 37.9022 45.9012 29.5087 3.0456 65.1278 48.6574 15.1006 11.5200 28.7569 38.9221 74.2810 6.5555 14.4246 6.2580 8.8473
temp: 298.150 k
press: 1.00000 atm
elementType: 8 8 8 8 6 6 6 6 6 6 6 6 6 6 6 1 1 1 1 1 1 1 1 1 1 1 1 1 1 1 1 1 1
symmnumber: 1
zpe: 730448.7 jmol-1
zpe.correction: 0.278213 hartree
zpe.thermalcorrener: 0.292630 hartree
zpe.thermalcorrenthalpy: 0.293574 hartree
zpe.thermalcorrgfe: 0.235329 hartree
zpe.sumelectzpe: -729.668341 hartree
zpe.sumelectthermal: -729.653924 hartree
zpe.sumelectthermalent: -729.652980 hartree
zpe.sumelectthermalfe: -729.711225 hartree
dipole: 0.2890 1.6001 0.2382
dipole: 1.6433
quadrupole: -77.1121 -95.2319 -91.1960
quadrupole: 7.3661 2.8114 -7.4686
quadrupole: 10.7345 -7.3852 -3.3493 7.3661 2.8114 -7.4686
hfenergy: -729.9465542 hartree
pointgroup: C01 [X(C11H18O4)]
dipole: -0.0895088 0.6091656 0.1972427 debye
polarizability: 162.6838098|-4.3208995|111.4155637|-9.5818139|0.7971663|109.0120916 unknown
InChI: InChI=1S/C11H18O4/c1-9(12)13-7-10-8-14-11(15-10)5-3-2-4-6-11/h10H,2-8H2,1H3
charge 0 multiplicity 1
33 atoms
O  0.592303 -0.794498 0.152062
O  0.789449 1.563677 0.06983
O  -2.992166 0.265493 -0.33615
O  -3.644098 -1.828412 0.467443
C  1.584736 0.324581 -0.025734
C  2.637332 0.226123 1.094397
C  2.205075 0.248273 -1.425019
C  3.498901 -1.050595 0.93548
C  3.076503 -1.021634 -1.580001
C  4.149057 -1.111623 -0.467596
C  -0.711057 -0.203166 0.541308
C  -0.357357 1.244542 0.944438
C  -1.648651 -0.290075 -0.675662
C  -3.913645 -0.629416 0.232354
C  -5.23789 0.055298 0.491852
H  2.133539 0.237579 2.07874
H  3.279545 1.126698 1.033175
H  2.821093 1.156983 -1.571961
H  1.3934 0.269407 -2.174266
H  4.274391 -1.076229 1.72459
H  2.851724 -1.937317 1.079956
H  2.419505 -1.911475 -1.527586
H  3.552992 -1.023677 -2.578631
H  4.867205 -0.272087 -0.577746
H  4.729271 -2.047821 -0.576537
H  -1.116873 -0.798762 1.377209
H  -1.155003 1.968215 0.716928
H  -0.074881 1.30957 2.013008
H  -1.750553 -1.339294 -0.999338
H  -1.284678 0.348369 -1.495977
H  -5.19201 1.125029 0.243125
H  -5.518447 -0.074936 1.551067
H  -6.022212 -0.430524 -0.114859
