program: Gaussian 09
title: 000230946
version: EM64L-G09RevD.01
frameworkgroup: C1[X(C14H16O4)]
method: RPBEPBE
basis: SDD
operation: Freq
keyword: #pfreq=noraman
keyword: PBEPBE/SDD
title: #p freq=noraman PBEPBE/SDD
converged: YES YES NO NO
title: Mulliken charges:
elementType: O O O O C C C C C C C C C C C C C C H H H H H H H H H H H H H H H H
charge: -0.283097 -0.244666 -0.259631 -0.238162 -0.054207 -0.336360 -0.078951 -0.356479 -0.233063 -0.295809 0.484268 0.291014 -0.388450 -0.398374 -0.231129 -0.234336 -0.745891 -0.240281 0.257698 0.217420 0.240500 0.243820 0.262090 0.242963 0.234986 0.252630 0.226295 0.231659 0.226912 0.228383 0.247161 0.248076 0.252146 0.230866
chargesum: 0.00000
title: Mulliken charges with hydrogens summed into heavy atoms:
elementType: O O O O C C C C C C C C C C C C C C
charge: -0.283097 -0.244666 -0.259631 -0.238162 0.203490 0.121559 0.164868 0.148574 0.001924 -0.043179 0.484268 0.291014 -0.162155 -0.166715 -0.004217 -0.005953 0.001493 -0.009415
polarizability: 2.20392178e+02 2.74794722e+01 1.60589235e+02 -1.33160256e+01 1.27425360e+01 1.22165805e+02
1716.lowfreq: -9.2452 -4.2024 0.0006 0.0008 0.0008 3.6439 13.5042 23.9349 27.6460
frequency: 13.2634 23.7748 27.6152 37.5750 47.4493 64.4815 75.3152 97.0605 104.2754 182.7813 200.2977 224.4509 271.2948 282.3368 303.4161 328.1798 403.5541 426.3691 452.2346 469.0760 489.2618 534.7627 563.3389 616.3186 617.4814 627.7107 632.8368 695.5570 724.9506 765.5095 776.2446 806.4985 827.8366 844.9841 849.9984 871.5353 906.9839 910.9954 924.4380 950.3435 972.6716 978.0220 988.9018 994.5339 996.7537 1003.3202 1011.6281 1027.3094 1041.7736 1070.1205 1085.3933 1112.4929 1126.3373 1172.8882 1179.4329 1189.5734 1194.4553 1210.0606 1234.6707 1247.0631 1274.2569 1285.8701 1294.5172 1303.5441 1312.1528 1335.1349 1349.1302 1369.5923 1384.0061 1385.1806 1440.3451 1452.1211 1453.4442 1454.6804 1466.8110 1486.2407 1585.4902 1612.3239 1660.4874 1666.1709 2991.5079 3009.2782 3030.0943 3033.5395 3042.3002 3097.9269 3102.2433 3116.3238 3119.5195 3120.1669 3124.5669 3126.3257 3138.6370 3144.5583 3149.2590 3165.7189
redmass: 6.2467 4.8080 4.1740 1.1552 4.7788 3.9224 3.0578 3.5499 4.8459 2.8213 5.0848 5.7906 3.2643 3.3506 4.4904 5.5330 2.7713 2.3635 3.4342 3.4319 3.9055 4.9592 3.1289 6.3792 4.5328 4.6736 5.3539 1.9225 3.1799 2.3288 3.7911 4.3887 2.5086 2.9318 1.3034 4.4344 2.4110 2.7019 1.5039 4.3470 4.0928 1.3920 6.0571 1.3451 2.3400 2.5724 1.1991 2.2065 1.6619 3.1395 1.6738 2.0097 2.8959 1.0664 1.2126 1.1342 3.1133 1.3518 1.4626 1.3733 1.3323 1.3832 1.2661 1.3393 1.2582 1.2579 1.3075 1.4257 1.2591 6.9049 2.2918 1.0722 1.0773 1.0503 1.0932 2.3088 5.8408 5.9986 9.0371 6.2371 1.0676 1.0369 1.0846 1.0864 1.0590 1.0970 1.0905 1.0887 1.1031 1.0866 1.1052 1.0861 1.0913 1.1011 1.0962 1.1016
irintensity: 0.0931 0.8585 1.6623 0.5979 0.5586 0.2547 0.6606 0.4113 0.0697 12.4564 3.0728 4.1043 0.9974 16.2871 0.7378 1.2302 0.0428 5.4416 12.7059 10.6100 8.3194 23.5067 2.7472 0.0510 4.4768 11.3663 0.8511 33.9472 31.3615 55.2715 23.2972 19.3690 2.9529 11.2593 0.6514 31.5391 2.0056 15.7728 0.5616 59.6443 56.7424 0.5071 0.1056 31.1158 183.2669 3.2438 36.5770 2.9490 10.4186 151.8749 21.7540 1.4443 16.0817 1.1092 22.2369 6.4535 294.1505 16.2225 23.1252 18.5531 4.4471 27.1011 7.8519 47.5757 0.6205 5.1057 3.9128 2.2606 59.4599 3.7271 11.8225 28.2428 8.1384 24.9393 4.2743 15.6103 2.8444 2.0159 187.2842 15.3585 36.5459 1.9964 21.1275 26.0084 32.4373 6.9594 3.2328 15.1590 8.0037 13.9937 22.7903 1.2787 9.3362 10.1046 42.4108 24.9536
temp: 298.150 k
press: 1.00000 atm
elementType: 8 8 8 8 6 6 6 6 6 6 6 6 6 6 6 6 6 6 1 1 1 1 1 1 1 1 1 1 1 1 1 1 1 1
symmnumber: 1
zpe: 711139.6 jmol-1
zpe.correction: 0.270859 hartree
zpe.thermalcorrener: 0.288436 hartree
zpe.thermalcorrenthalpy: 0.289380 hartree
zpe.thermalcorrgfe: 0.220523 hartree
zpe.sumelectzpe: -842.610394 hartree
zpe.sumelectthermal: -842.592817 hartree
zpe.sumelectthermalent: -842.591873 hartree
zpe.sumelectthermalfe: -842.660730 hartree
dipole: -0.9825 -1.6616 2.6423
dipole: 3.2723
quadrupole: -95.8943 -103.9319 -109.6945
quadrupole: -0.6083 9.3071 0.4167
quadrupole: 7.2793 -0.7583 -6.5209 -0.6083 9.3071 0.4167
hfenergy: -842.8812532 hartree
pointgroup: C01 [X(C14H16O4)]
dipole: 0.1985495 0.887084 0.9116506 debye
polarizability: 213.8591186|33.4077552|152.1304893|24.3532924|-13.5236554|137.1576109 unknown
InChI: InChI=1S/C14H16O4/c1-11(15)16-9-13-10-17-14(18-13)8-7-12-5-3-2-4-6-12/h2-8,13-14H,9-10H2,1H3
charge 0 multiplicity 1
34 atoms
O  -0.905833 -1.78144 -1.224911
O  -1.300913 -2.646783 0.931022
O  -3.206794 1.105275 -0.475639
O  -4.366836 0.803822 -2.482108
C  -2.116851 -1.097932 -0.680801
C  -2.073363 -1.388158 0.841638
C  -0.262327 -2.506486 -0.107809
C  -2.029324 0.389582 -1.046002
C  0.961833 -1.792602 0.425768
C  1.568986 -0.744492 -0.196076
C  2.767814 -0.009396 0.254548
C  -4.327374 1.249693 -1.315588
C  3.459122 -0.303935 1.465218
C  3.260838 1.050077 -0.558597
C  4.59861 0.433634 1.842315
C  4.401792 1.790049 -0.182007
C  -5.415216 2.018917 -0.599972
C  5.076909 1.484839 1.02177
H  -2.999425 -1.557176 -1.161652
H  -1.562023 -0.572927 1.390385
H  -3.058725 -1.58633 1.285566
H  -0.037838 -3.532382 -0.45151
H  -2.011416 0.520125 -2.141067
H  -1.154765 0.865011 -0.574882
H  1.345347 -2.216541 1.363657
H  1.129611 -0.411287 -1.147453
H  3.104112 -1.111945 2.114818
H  2.742112 1.288386 -1.495622
H  5.117904 0.192528 2.776778
H  4.763875 2.600556 -0.824203
H  -5.628743 1.56195 0.38095
H  -6.325417 2.03429 -1.216203
H  -5.08088 3.05474 -0.413502
H  5.963394 2.055943 1.318869
