program: Gaussian 09
title: 000230941
version: EM64L-G09RevD.01
frameworkgroup: C1[X(C13H17N5O3)]
method: RPBEPBE
basis: SDD
operation: Freq
keyword: #p
keyword: freq=noraman
keyword: PBEPBE/SDD
title: #p freq=noraman PBEPBE/SDD
converged: YES YES NO NO
title: Mulliken charges:
elementType: O O O N N N N N C C C C C C C C C C C C C H H H H H H H H H H H H H H H H H
charge: -0.221605 -0.245907 -0.214817 -0.188684 -0.097181 0.082473 -0.318933 -0.049970 0.216056 -0.334143 0.021982 0.138130 -0.117004 -0.673966 0.000199 -0.360344 0.177652 -0.309549 -0.713978 -0.255559 -0.655791 0.253042 0.244886 0.232069 0.248991 0.221402 0.271587 0.337069 0.235376 0.234025 0.233920 0.224944 0.225724 0.222432 0.234814 0.210645 0.251282 0.238733
chargesum: 0.00000
title: Mulliken charges with hydrogens summed into heavy atoms:
elementType: O O O N N N N N C C C C C C C C C C C C C
charge: -0.221605 -0.245907 -0.214817 -0.188684 -0.097181 0.082473 0.018135 -0.049970 0.216056 0.163785 0.021982 0.138130 -0.117004 0.028495 0.000199 -0.088757 0.177652 0.159853 -0.029390 0.201687 0.044868
polarizability: 3.37441457e+02 1.78291426e+01 1.86096188e+02 -7.18880992e+00 -3.00146792e+00 1.11958129e+02
1716.lowfreq: -6.1354 -3.9683 -1.5002 -0.0003 -0.0002 0.0005 13.8662 23.7638 36.7095
frequency: 13.7050 23.6445 36.6586 42.4442 44.8669 65.0387 80.8859 96.1540 103.5715 123.2415 153.0692 156.8217 203.8836 211.3089 225.3540 227.8736 258.1404 269.4234 275.1025 302.8813 333.0769 355.9785 391.9087 423.1340 431.1467 443.9778 464.2542 490.8016 513.7990 557.3337 565.2051 582.4279 600.3778 670.0367 701.6056 712.2657 731.2314 758.8067 775.6448 789.9492 795.0866 805.0409 821.2784 829.8529 857.1033 882.7347 934.9672 944.3973 965.3042 1002.9320 1014.1493 1065.5668 1082.2021 1094.1551 1097.0246 1114.4338 1142.2475 1143.9881 1156.3664 1184.8323 1214.3233 1255.2334 1259.3154 1260.6717 1273.6657 1293.5059 1334.0917 1343.0062 1347.9099 1350.8587 1358.2781 1384.6899 1393.2180 1400.7146 1405.9214 1438.4973 1457.1494 1458.5741 1461.4290 1470.6865 1477.0466 1478.9969 1482.2649 1483.6394 1484.2678 1495.5417 1516.2283 1550.9514 1557.5961 1601.3585 1636.1073 2986.7408 2988.0476 2993.6770 2995.1643 3029.4600 3029.7987 3045.5012 3082.4951 3091.1668 3092.2612 3095.0604 3097.1075 3097.8280 3122.2222 3122.6847 3152.4745 3556.8059
redmass: 2.7325 4.2925 3.4757 2.8805 3.1155 4.0058 3.5943 3.6715 5.6850 4.6043 3.2669 3.8955 1.5301 1.3015 4.5658 2.3453 1.8303 2.5072 2.7238 3.0616 5.0738 3.4160 5.0275 4.0832 7.3999 5.4649 4.6563 5.4497 6.3554 2.3696 1.5543 6.7847 7.1306 7.1003 7.4278 4.9638 5.9227 4.3706 1.8627 2.7121 1.1913 3.0575 2.3259 4.1042 3.8393 3.1386 2.1585 1.4588 3.1333 2.7818 3.0936 3.9869 2.7845 2.2589 2.1601 4.3547 3.1240 1.5265 1.6886 2.5788 3.5607 4.5057 1.1340 3.3235 1.1222 1.7664 1.5185 1.7982 1.6267 1.3163 2.3277 1.2144 1.2256 1.2815 2.5753 1.4808 1.4786 1.1392 1.0651 1.1109 2.2438 1.0556 1.0621 1.3655 1.0615 1.0918 8.8378 6.4448 7.5920 9.9909 10.7640 1.0490 1.0470 1.0352 1.0366 1.0598 1.1034 1.0598 1.1012 1.0977 1.0983 1.1016 1.1029 1.0985 1.1057 1.1053 1.0935 1.0773
irintensity: 0.0474 1.1854 1.7357 0.7012 1.4224 0.7880 0.1540 0.4629 1.9504 1.0050 1.7620 0.9476 2.7363 1.0612 3.7380 0.3840 0.3655 0.5778 0.7857 16.8890 3.0219 5.7212 3.0117 1.8571 6.3188 8.6160 17.7249 5.7184 5.9173 14.4146 84.4824 2.1318 32.5439 7.1560 2.1680 16.1756 6.4605 3.6400 9.0796 5.0274 4.7977 24.4153 5.2158 3.8521 3.6968 8.0207 1.2955 11.4341 18.3606 16.0492 76.1353 100.9865 62.1035 143.6352 0.1794 167.9575 6.1091 2.0678 36.0870 20.6556 11.8461 104.6085 1.2463 13.0694 4.6208 53.5760 0.8411 24.1549 17.0827 2.5037 13.8154 20.8319 29.4449 27.8429 26.9992 3.6031 45.3402 19.9154 12.3494 28.7758 96.2123 15.2033 7.3531 15.4011 27.4727 81.2335 293.6176 416.0770 1080.5107 90.7648 153.4034 29.9049 24.7461 21.7296 20.9647 36.7312 12.4186 10.6143 44.9485 37.0866 33.9284 7.3800 4.6280 26.9978 4.7248 29.3643 4.7757 133.9814
temp: 298.150 k
press: 1.00000 atm
elementType: 8 8 8 7 7 7 7 7 6 6 6 6 6 6 6 6 6 6 6 6 6 1 1 1 1 1 1 1 1 1 1 1 1 1 1 1 1 1
symmnumber: 1
zpe: 781430.2 jmol-1
zpe.correction: 0.297631 hartree
zpe.thermalcorrener: 0.318833 hartree
zpe.thermalcorrenthalpy: 0.319777 hartree
zpe.thermalcorrgfe: 0.244343 hartree
zpe.sumelectzpe: -1003.476663 hartree
zpe.sumelectthermal: -1003.455462 hartree
zpe.sumelectthermalent: -1003.454517 hartree
zpe.sumelectthermalfe: -1003.529951 hartree
dipole: -5.6072 2.3554 1.7485
dipole: 6.3282
quadrupole: -91.2699 -127.8261 -125.5386
quadrupole: -1.6460 9.3958 -2.3257
quadrupole: 23.6083 -12.9479 -10.6604 -1.6460 9.3958 -2.3257
hfenergy: -1003.7742943 hartree
pointgroup: C01 [X(C13H17N5O3)]
dipole: 2.2462012 -0.6631179 0.8446923 debye
polarizability: 337.1745138|17.6765349|180.0969111|-9.3846758|-21.1029855|118.2243492 unknown
InChI: InChI=1S/C13H17N5O3/c1-4-14-13-15-7-8-10(17-13)18(5-2)11(19)9(16-8)12(20)21-6-3/h7,14H,4-6H2,1-3H3
charge 0 multiplicity 1
38 atoms
O  -2.076698 -1.838939 0.200876
O  -3.790499 0.582848 1.038677
O  -3.86408 1.171487 -1.224531
N  0.126428 -1.024956 0.103098
N  2.340497 -0.170575 -0.027184
N  -0.933726 1.581342 -0.362974
N  4.488127 0.764496 -0.196339
N  2.69981 2.233748 -0.481286
C  0.997591 0.045892 -0.079812
C  0.64768 -2.397088 0.357763
C  0.432868 1.34635 -0.325897
C  -1.29805 -0.850599 0.067852
C  -1.743892 0.548194 -0.161752
C  0.790472 -2.678717 1.866401
C  3.133536 0.929352 -0.232784
C  1.364678 2.407732 -0.520333
C  -3.232834 0.799104 -0.211649
C  5.157964 -0.524541 0.04184
C  6.684246 -0.343498 0.038551
C  -5.282584 0.69245 1.136748
C  -5.939953 -0.627348 0.725173
H  -0.074508 -3.095767 -0.095178
H  1.622295 -2.473916 -0.1483
H  1.504092 -1.977716 2.332572
H  -0.184992 -2.593177 2.374604
H  1.166215 -3.706792 2.017005
H  0.985166 3.416817 -0.712443
H  5.040736 1.609056 -0.356976
H  4.812973 -0.939832 1.007884
H  4.847183 -1.246619 -0.737748
H  7.17951 -1.31331 0.215567
H  7.041479 0.044426 -0.933165
H  7.008573 0.351397 0.834717
H  -5.449424 0.929893 2.199256
H  -5.615126 1.531349 0.500074
H  -7.030389 -0.568803 0.901298
H  -5.771931 -0.833855 -0.344724
H  -5.53253 -1.466686 1.313316
