program: Gaussian 09
title: 000230940
version: EM64L-G09RevD.01
frameworkgroup: C1[X(C13H11N7)]
method: RPBEPBE
basis: SDD
operation: Freq
keyword: #pfreq=noraman
keyword: PBEPBE/SDD
title: #p freq=noraman PBEPBE/SDD
converged: YES YES NO NO
title: Mulliken charges:
elementType: N N N N N N N C C C C C C C C C C C C C H H H H H H H H H H H
charge: -0.254022 -0.050922 -0.162978 -0.035501 -0.567385 -0.355694 -0.020786 -0.046434 0.097199 0.147731 0.111075 0.407858 -0.531203 -0.257459 -0.351584 -0.391239 -0.226150 -0.203957 -0.244166 -0.123314 0.264395 0.324071 0.261480 0.305635 0.294173 0.226254 0.231745 0.328705 0.327793 0.230346 0.264333
chargesum: 0.00000
title: Mulliken charges with hydrogens summed into heavy atoms:
elementType: N N N N N N N C C C C C C C C C C C C C
charge: -0.254022 -0.050922 -0.162978 -0.035501 0.089113 -0.091361 -0.020786 -0.046434 0.097199 0.147731 0.111075 0.407858 0.057263 0.004021 -0.045949 -0.097067 0.000105 0.027788 -0.013820 -0.123314
polarizability: 2.91275616e+02 -8.47094646e+00 2.16539579e+02 -4.25024507e+00 -3.67830225e+00 8.60865755e+01
1716.lowfreq: -5.8567 -0.0009 -0.0006 -0.0005 2.6863 5.5136 11.4528 36.3776 55.0005
frequency: 10.7456 36.3482 54.9927 71.6741 101.2291 119.3822 142.8386 187.8367 216.1807 242.9902 272.9875 283.7291 301.7676 312.8139 343.6483 354.5635 362.9050 396.9961 409.5630 446.7748 463.7209 478.9317 502.7121 563.4492 597.7350 613.4569 621.6492 626.5847 661.1255 671.8326 691.0450 701.3022 756.1068 773.3528 787.2778 852.5230 859.7588 865.7617 866.6074 890.5017 937.0776 940.4691 942.5523 988.1454 994.0391 1003.7833 1023.8203 1048.6756 1066.2266 1099.2569 1121.9369 1172.8795 1178.8716 1191.2786 1206.2975 1221.7247 1225.0109 1257.1124 1277.5389 1325.5063 1331.5859 1354.9756 1382.0319 1391.2353 1429.9169 1452.2872 1458.6383 1490.7893 1505.0358 1510.5818 1528.1268 1597.3889 1611.2112 1637.0084 1683.2915 2206.4734 2980.0137 3031.9259 3131.6843 3143.2440 3144.2131 3162.8429 3182.4686 3190.1707 3346.8982 3473.9089 3619.2633
redmass: 6.6393 3.9071 6.6135 7.8423 5.5021 5.3386 5.0790 3.6845 6.1007 5.6222 5.2726 6.7491 5.2413 1.2002 3.5943 3.0451 4.4834 6.0285 2.9680 1.9082 3.2524 7.1665 3.3955 4.1195 6.2158 6.3986 6.2340 6.4045 8.4163 8.3580 7.1778 2.1461 7.2202 1.6725 7.3613 1.2455 1.2469 4.4081 4.6167 1.4098 3.0214 2.8735 1.4072 6.1946 1.3553 1.3026 2.6277 4.8918 2.9984 1.8539 2.0163 1.0684 4.4874 1.1572 1.3900 2.6278 1.2057 4.1385 2.7481 1.6441 1.8500 1.5992 5.3090 5.7350 3.3793 1.7698 1.5060 2.7700 7.5783 8.3965 7.2370 6.8869 5.8971 1.1764 6.3485 12.4489 1.0597 1.0996 1.0855 1.0930 1.0909 1.0972 1.0956 1.0957 1.0730 1.0407 1.1064
irintensity: 2.6744 0.6024 2.2338 2.5067 7.9498 0.2982 2.9926 6.7639 1.5566 0.2866 0.3985 4.6699 1.4633 20.0021 0.5879 1.3598 1.2613 25.1586 0.0188 101.2762 81.6864 10.6641 3.5424 10.4506 3.9286 0.0659 4.6238 4.0551 8.1412 23.1071 5.6637 38.0166 0.8966 68.1759 8.9602 83.8644 0.1992 12.2157 34.1467 14.0152 12.5056 7.0388 9.4135 0.6394 0.0926 2.1657 19.2635 16.5153 2.4706 1.8714 138.7439 0.6340 9.7940 19.1531 74.9286 79.5483 0.0613 18.3049 12.0913 21.6718 26.3801 6.1733 15.0927 18.3050 19.9145 23.4828 27.2420 125.0865 32.0601 115.0928 110.3620 3.9041 46.4652 50.0298 333.5027 14.2754 16.3238 13.3998 0.3406 5.0286 21.0974 27.7021 14.4171 5.6124 24.9233 7.2779 19.2532
temp: 298.150 k
press: 1.00000 atm
elementType: 7 7 7 7 7 7 7 6 6 6 6 6 6 6 6 6 6 6 6 6 1 1 1 1 1 1 1 1 1 1 1
symmnumber: 1
zpe: 602408.4 jmol-1
zpe.correction: 0.229445 hartree
zpe.thermalcorrener: 0.246209 hartree
zpe.thermalcorrenthalpy: 0.247154 hartree
zpe.thermalcorrgfe: 0.183124 hartree
zpe.sumelectzpe: -883.791192 hartree
zpe.sumelectthermal: -883.774428 hartree
zpe.sumelectthermalent: -883.773484 hartree
zpe.sumelectthermalfe: -883.837513 hartree
dipole: 2.5788 -8.9710 -1.2934
dipole: 9.4235
quadrupole: -92.9552 -120.3148 -117.9838
quadrupole: -20.8616 -0.1409 -11.2389
quadrupole: 17.4627 -9.8969 -7.5659 -20.8616 -0.1409 -11.2389
hfenergy: -884.0206371 hartree
pointgroup: C01 [X(C13H11N7)]
dipole: -0.3635352 -3.6438204 0.5795594 debye
polarizability: 285.6295112|20.8016975|221.8364542|-10.3987409|0.0612642|86.4358044 unknown
InChI: InChI=1S/C13H11N7/c14-7-6-10-11-12(15)19(16)8-17-13(11)20(18-10)9-4-2-1-3-5-9/h1-5,8,15H,6,16H2
charge 0 multiplicity 1
31 atoms
N  0.82335 0.198377 0.11839
N  0.191233 1.443625 0.293411
N  -2.292818 -2.436663 0.005003
N  0.116746 -2.187721 -0.101203
N  -3.391779 -3.319099 -0.041982
N  -3.816066 -0.52782 0.32319
N  -1.819504 4.430819 -0.957624
C  -1.38973 -0.219128 0.21697
C  -0.117514 -0.82461 0.069468
C  -1.142809 1.177863 0.350005
C  -2.60914 -1.010014 0.195472
C  2.257233 0.162755 0.010009
C  -2.173685 2.265023 0.556441
C  -0.985172 -2.920419 -0.125752
C  2.942862 -1.071074 -0.118801
C  2.969731 1.387233 0.035691
C  4.350365 -1.06631 -0.220721
C  4.375434 1.370259 -0.067475
C  5.074605 0.147207 -0.19546
C  -1.963464 3.457924 -0.283017
H  -2.182042 2.584149 1.617475
H  -3.168788 1.823967 0.352584
H  -0.904438 -4.004918 -0.258303
H  2.380374 -2.006568 -0.142103
H  2.416538 2.323777 0.132274
H  4.880585 -2.019847 -0.320808
H  4.924489 2.317908 -0.049192
H  -3.582222 -3.723619 -0.961387
H  -3.483715 -3.938902 0.765778
H  6.166932 0.141086 -0.275442
H  -4.540388 -1.27266 0.269609
