program: Gaussian 09
title: 000230938
version: EM64L-G09RevD.01
frameworkgroup: C1[X(C11H12N6O2)]
method: RPBEPBE
basis: SDD
operation: Freq
keyword: #p
keyword: freq=noraman
keyword: PBEPBE/SDD
title: #p freq=noraman PBEPBE/SDD
converged: YES YES NO NO
title: Mulliken charges:
elementType: O O N N N N N N C C C C C C C C C C C H H H H H H H H H H H H
charge: -0.239263 -0.213243 -0.180991 -0.064618 -0.001167 -0.051418 -0.621032 -0.026115 -0.097115 0.148620 0.152940 0.155387 -0.530303 -0.614717 -0.133792 0.183754 -0.120498 -0.252154 -0.667639 0.279549 0.286134 0.246515 0.248086 0.271050 0.342495 0.342954 0.232351 0.224767 0.216331 0.228789 0.254340
chargesum: 0.00000
title: Mulliken charges with hydrogens summed into heavy atoms:
elementType: O O N N N N N N C C C C C C C C C C C
charge: -0.239263 -0.213243 -0.180991 -0.064618 -0.001167 -0.051418 0.064418 -0.026115 -0.097115 0.148620 0.152940 0.155387 0.035379 0.150934 -0.133792 0.183754 -0.120498 0.204964 0.031822
polarizability: 2.26103185e+02 1.82390034e+00 1.89767913e+02 -2.20641770e+00 2.82582069e+00 9.68470433e+01
1716.lowfreq: -3.4582 0.0003 0.0007 0.0007 1.2104 5.3068 15.6056 36.5228 54.5005
frequency: 15.5187 36.5177 54.4996 70.8269 77.5980 97.6029 103.0582 116.0551 138.2486 174.4159 206.0650 218.1463 226.0082 240.5243 268.2140 275.3853 303.6087 358.1914 360.0948 374.6013 387.1126 440.0231 469.7191 517.0116 530.3803 549.7959 584.0517 598.6560 632.1844 639.3008 674.9335 694.8601 718.0465 736.5432 763.6938 803.1701 809.1619 821.9003 885.0228 919.1993 927.5068 963.2467 990.9040 1020.0903 1030.0094 1095.6431 1124.7864 1129.6319 1151.3385 1156.1874 1186.6930 1222.4224 1248.2168 1276.9295 1298.1976 1321.7973 1352.7218 1354.8728 1381.2867 1390.2460 1399.8310 1428.0057 1431.6834 1444.6518 1455.6039 1463.2542 1467.7431 1470.1429 1485.8505 1496.3985 1540.7841 1572.5045 1629.0490 1635.5889 2195.4918 2982.8162 2993.2788 3006.6803 3028.3163 3056.1565 3088.6115 3094.8938 3100.8592 3120.3271 3127.6332 3510.0446 3658.3981
redmass: 4.7498 4.9430 5.1548 4.9168 3.8664 3.1967 1.4448 3.3060 3.5229 3.7613 3.9637 1.5859 7.0326 2.3921 4.8276 5.5780 2.5941 4.6398 5.0202 4.6176 5.7199 4.1421 8.4118 4.8636 1.3347 4.0403 5.9260 1.6038 3.3510 4.8647 6.0678 6.2441 7.3803 4.1216 9.7858 4.6151 2.0000 2.7722 5.5472 4.4977 2.2377 4.5488 2.5894 2.8586 3.3581 2.1405 2.8352 1.3125 4.1665 1.9316 1.2871 2.6384 5.1908 1.1218 1.6421 3.9675 5.2084 1.5486 5.8122 1.2305 5.3633 1.5164 1.5466 2.1693 1.1217 1.0421 1.6543 1.0434 1.0516 1.9675 5.4901 4.1915 2.7801 2.4873 12.4267 1.0637 1.0361 1.0329 1.0597 1.0944 1.0974 1.1033 1.1027 1.1058 1.1019 1.0455 1.1048
irintensity: 1.4186 0.4001 5.6642 2.7033 1.8577 1.1804 1.4852 5.8929 2.4567 1.9725 0.9286 3.9082 3.9947 13.1518 3.7957 2.5261 10.5524 3.9716 1.1178 5.0199 1.5217 1.7469 2.1508 4.8550 40.0948 3.2718 11.0896 159.3677 38.8416 4.5339 23.3937 23.6526 16.5175 30.4349 5.9917 8.0902 10.1617 2.5324 14.9536 15.7579 0.8203 0.3842 15.1361 41.7501 145.4598 29.0447 17.1714 0.5737 232.0550 124.2826 4.0302 29.5579 14.7474 6.5800 9.1466 39.0557 77.7672 6.4268 5.8554 25.3273 12.2870 20.7355 23.1264 8.7158 13.6173 15.5411 32.6710 17.2586 12.7931 28.2660 167.6935 134.5585 374.9522 125.9272 8.6035 6.4806 22.5659 43.0225 33.6903 0.9055 38.8849 0.3409 16.0196 29.8977 2.1976 143.1683 106.1500
temp: 298.150 k
press: 1.00000 atm
elementType: 8 8 7 7 7 7 7 7 6 6 6 6 6 6 6 6 6 6 6 1 1 1 1 1 1 1 1 1 1 1 1
symmnumber: 1
zpe: 606490.4 jmol-1
zpe.correction: 0.231000 hartree
zpe.thermalcorrener: 0.249329 hartree
zpe.thermalcorrenthalpy: 0.250273 hartree
zpe.thermalcorrgfe: 0.182687 hartree
zpe.sumelectzpe: -903.939355 hartree
zpe.sumelectthermal: -903.921026 hartree
zpe.sumelectthermalent: -903.920082 hartree
zpe.sumelectthermalfe: -903.987668 hartree
dipole: -1.1506 2.8349 -0.4133
dipole: 3.0873
quadrupole: -99.3921 -105.5534 -114.1166
quadrupole: 0.7966 14.9798 1.0369
quadrupole: 6.9619 0.8006 -7.7626 0.7966 14.9798 1.0369
hfenergy: -904.1703549 hartree
pointgroup: C01 [X(C11H12N6O2)]
dipole: 0.4477581 0.9636582 0.588375 debye
polarizability: 226.1470493|-1.3400687|177.7993923|-1.187934|31.2523022|108.7716999 unknown
InChI: InChI=1S/C11H12N6O2/c1-3-19-11(18)9-14-8(13)7-6(4-5-12)16-17(2)10(7)15-9/h3-4,13H2,1-2H3
charge 0 multiplicity 1
31 atoms
O  -3.620401 0.666906 -0.042432
O  -3.446927 -1.581967 0.566498
N  1.16106 2.149773 0.935843
N  2.52408 1.869853 0.853049
N  -0.962398 0.98609 0.58426
N  -0.677652 -1.327783 -0.160132
N  1.363113 -2.325273 -0.651103
N  4.428517 -1.487272 -1.830829
C  1.315362 0.001789 0.231027
C  0.398336 1.051837 0.58033
C  2.619333 0.573892 0.435284
C  0.689109 -1.223149 -0.196807
C  4.009875 -0.022887 0.357725
C  0.682706 3.464209 1.360705
C  -1.420791 -0.246106 0.22599
C  -2.914868 -0.487073 0.277114
C  4.258222 -0.812564 -0.861296
C  -5.113019 0.547068 -0.02529
C  -5.626879 -0.001168 -1.359762
H  4.200639 -0.678741 1.23114
H  4.739915 0.804953 0.41585
H  1.032842 3.687819 2.382111
H  1.048762 4.244313 0.672985
H  -0.417808 3.436129 1.34144
H  2.352068 -2.30467 -0.896856
H  0.794101 -3.125947 -0.926921
H  -5.404816 -0.10615 0.816063
H  -5.44814 1.580351 0.157188
H  -6.732751 0.008219 -1.364523
H  -5.272423 0.618463 -2.201428
H  -5.289666 -1.039816 -1.511821
