program: Gaussian 09
title: 000230936
version: EM64L-G09RevD.01
frameworkgroup: C1[X(C11H9N5)]
method: RPBEPBE
basis: SDD
operation: Freq
keyword: #pfreq=noraman
keyword: PBEPBE/SDD
title: #p freq=noraman PBEPBE/SDD
converged: YES YES NO NO
title: Mulliken charges:
elementType: N N N N N C C C C C C C C C C C H H H H H H H H H
charge: -0.257727 -0.058476 0.060589 -0.030709 -0.005794 0.011975 0.437663 0.006345 0.146866 -0.428909 0.191131 -0.754192 -0.520899 -0.782831 -0.203347 -0.114113 0.248685 0.260856 0.234256 0.267311 0.279173 0.273566 0.267254 0.236498 0.234830
chargesum: 0.00000
title: Mulliken charges with hydrogens summed into heavy atoms:
elementType: N N N N N C C C C C C C C C C C
charge: -0.257727 -0.058476 0.060589 -0.030709 -0.005794 0.011975 0.437663 0.006345 0.146866 -0.180224 0.191131 0.008230 0.031840 -0.044249 -0.203347 -0.114113
polarizability: 2.09993766e+02 1.02141776e+01 1.70088627e+02 -4.93271385e+00 -5.03797697e-01 8.40385325e+01
1716.lowfreq: -5.6510 -0.0005 -0.0003 -0.0001 3.4574 5.7082 7.4580 56.8862 75.2712
frequency: -5.0572 56.8852 75.2510 84.6157 107.4991 134.3650 145.0019 194.8270 197.5448 204.9923 264.5842 288.3349 329.2970 350.4636 380.5306 405.8227 428.6166 487.4853 516.8524 534.0268 545.9816 553.7961 607.4825 641.3404 655.8782 730.5173 769.7993 783.2108 856.3736 861.7932 921.4716 932.8702 954.2710 966.5987 1023.6324 1045.4910 1049.5320 1076.8233 1136.3548 1160.3936 1185.3722 1227.4690 1284.5780 1319.8881 1331.3097 1377.1977 1390.4920 1400.8933 1408.5512 1441.0280 1443.4932 1448.7592 1462.2193 1465.6127 1479.6411 1510.5193 1553.2772 1616.3750 2186.2962 2208.5974 2986.3153 2997.7615 3007.2005 3063.1877 3067.0835 3075.1249 3124.3427 3126.9441 3176.5337
redmass: 6.4047 5.6111 1.0728 5.8339 8.8147 4.8382 1.1084 3.1939 3.4201 4.4922 2.5823 7.2295 3.2767 4.0807 7.1101 6.5277 8.4242 7.3607 8.2357 4.9824 5.3337 4.7473 4.4148 4.9059 4.9342 9.1200 7.5828 9.0599 7.7761 1.2609 2.6944 3.1285 5.5404 1.7344 1.4785 1.5889 1.5455 5.3930 4.9706 4.0976 1.4267 1.8000 2.3139 2.4489 3.7856 3.4503 1.9410 2.3025 1.2314 1.0867 1.5794 1.0430 1.4256 1.0461 2.2085 4.7704 7.3285 7.4118 12.5986 12.4467 1.0388 1.0378 1.0599 1.0969 1.1000 1.0962 1.1004 1.0982 1.0934
irintensity: 4.2396 3.0666 0.5818 0.8512 2.5805 3.0652 0.3499 1.2643 6.3569 2.0952 2.2522 1.9919 1.3377 0.0537 3.2498 0.9862 0.5248 0.8098 0.2705 0.6645 3.2781 3.6696 2.6895 1.3870 8.9613 5.5700 1.0716 1.1759 3.1495 17.6563 3.6459 4.8223 0.8627 5.1812 0.2637 10.6354 5.2304 8.2453 23.5159 13.4939 5.6808 5.3579 11.3110 5.8323 9.2707 21.2647 32.4599 46.8098 22.9061 20.1389 46.9392 19.0177 74.9416 17.9427 5.9442 35.7747 152.1690 134.3702 78.6736 7.1755 11.6944 4.1724 2.2450 12.7501 0.1402 3.8834 12.5399 5.4860 2.5356
temp: 298.150 k
press: 1.00000 atm
elementType: 7 7 7 7 7 6 6 6 6 6 6 6 6 6 6 6 1 1 1 1 1 1 1 1 1
symmnumber: 1
zpe: 477469.5 jmol-1
zpe.correction: 0.181859 hartree
zpe.thermalcorrener: 0.195690 hartree
zpe.thermalcorrenthalpy: 0.196634 hartree
zpe.thermalcorrgfe: 0.141005 hartree
zpe.sumelectzpe: -697.179661 hartree
zpe.sumelectthermal: -697.165830 hartree
zpe.sumelectthermalent: -697.164885 hartree
zpe.sumelectthermalfe: -697.220515 hartree
dipole: -6.7462 -4.5127 -2.6249
dipole: 8.5303
quadrupole: -89.2478 -107.6619 -94.3634
quadrupole: 6.4360 -13.6497 3.6967
quadrupole: 7.8432 -10.5709 2.7276 6.4360 -13.6497 3.6967
hfenergy: -697.3615193 hartree
pointgroup: C01 [X(C11H9N5)]
dipole: 2.8455262 -1.5941013 0.7905492 debye
dipolederiv: -0.2560635 -0.0405991 0.0254843 0.6759871 -0.5712414 -0.0869633 0.0353103 0.0322275 0.086905 -0.5698079 0.2674054 0.0522633 0.0235032 -0.4593878 0.0064558 0.0678901 -0.0342282 -0.2098034 -0.9007787 0.1354201 0.1096549 -0.0001347 -0.3436172 0.0038822 0.1307908 -0.0210091 -0.2093482 -0.3420795 0.1341836 0.0153818 0.2169545 -0.4506803 -0.0392744 0.0161383 -0.0220153 -0.2459406 -0.2676138 -0.0137871 0.0052008 -0.0555345 -0.2238868 0.010286 -0.0970912 -0.0170203 -0.1990805 0.9310868 -0.2140122 -0.1355763 -0.3986656 0.1771526 0.0532787 -0.1382004 0.0386373 0.1042141 0.434614 0.2143837 -0.061278 -0.2167296 0.6920613 -0.0017377 -0.0605778 -0.0566914 0.0557208 -0.5244829 0.0230802 0.0580999 0.2353331 -0.3332688 -0.0243513 0.0694995 -0.0036297 -0.0041482 0.5636948 0.1026394 -0.0261234 0.0212884 0.6284953 -0.0368287 -0.0645712 -0.0540759 -0.0404395 -0.2282595 -0.2928703 0.0079971 -0.1556656 -0.6399915 0.040632 0.0133035 0.0687669 -0.1669023 0.8405841 0.0632848 -0.1369999 0.1379825 0.7213193 -0.0400257 -0.1477571 -0.0335301 0.0894032 0.0618895 -0.1595362 -0.0078525 -0.0121014 -0.252115 0.0111727 -0.013168 0.0360478 0.0092479 0.148669 0.0166241 -0.0304701 -0.0813638 0.150314 -0.0453342 -0.0248408 -0.0596959 0.1056705 -0.3155543 -0.1522201 0.0649261 -0.0810992 -0.0490021 0.0173805 0.0724246 0.032327 0.018993 0.1682652 -0.3012608 -0.0121097 -0.4260924 0.5314313 0.0705115 -0.0064837 0.0412096 0.0531274 -0.051074 0.0263852 0.0951919 0.0709647 0.000973 0.0533158 0.1704779 0.0813524 0.0565867 -0.0046855 0.0698884 0.0268984 0.0786947 0.0611118 -0.0114003 0.028333 -0.0109115 0.1572101 0.1078521 -0.0065037 0.0669111 0.0023648 0.0639897 0.0131121 0.0437489 0.0535771 -0.0243543 -0.0879619 0.1159354 0.0350021 0.0166921 0.0688228 -0.0012267 0.0396041 -0.0210523 0.1145595 0.0556049 -0.0283302 -0.0901889 -0.0065218 0.0663705 -0.0141839 -0.0706843 -0.0454567 0.0394775 0.0652706 0.0045354 -0.0261923 0.0622633 0.0247746 -0.0561062 -0.0384362 -0.0208513 0.1039119 0.0418385 -0.0318613 -0.0217764 -0.060387 0.0503679 0.0710033 -0.0123292 0.0299175 0.0283919 0.1002755 0.0777218 0.0034436 -0.0160446 -0.05573 0.0061483 0.0036575 -0.0108262 0.1231621 0.0511876 -0.0092912 0.0648398 -0.026071 0.0689317 -0.0688489 0.1065302 -0.0322968 -0.0562372 -0.0224711 -0.0012153 -0.0827276 -0.005617 0.0728053 0.0691025 -0.1235689 0.0292275 0.0096726 unknown
polarizability: 210.7229767|-5.7759166|168.1510342|-11.3705983|6.1864506|85.2469141 unknown
InChI: InChI=1S/C11H9N5/c1-7-5-8(2)16-11(14-7)9(6-13)10(15-16)3-4-12/h5H,3H2,1-2H3
charge 0 multiplicity 1
25 atoms
N  0.675139 -0.811955 0.171839
N  -0.564015 -1.399987 0.417654
N  1.728075 1.373054 -0.09105
N  -1.854986 3.294131 0.499202
N  -4.156852 -1.686337 -1.258917
C  0.622962 0.612397 0.132733
C  1.859128 -1.506456 -0.024664
C  -0.745341 0.928905 0.365596
C  -1.411152 -0.330034 0.527668
C  2.987267 -0.718388 -0.256225
C  2.901907 0.72091 -0.284301
C  1.812271 -3.004149 0.025328
C  -2.883395 -0.552686 0.795666
C  4.13232 1.55793 -0.53598
C  -1.331508 2.219306 0.432382
C  -3.58515 -1.178503 -0.344235
H  3.94969 -1.208646 -0.420247
H  1.442817 -3.35126 1.007267
H  2.810685 -3.428717 -0.158917
H  1.102666 -3.396251 -0.725486
H  -3.367923 0.41334 1.025501
H  -3.00981 -1.205123 1.679922
H  3.866518 2.624971 -0.511599
H  4.577787 1.323581 -1.52096
H  4.9091 1.364566 0.227324
