program: Gaussian 09
title: 000230918
version: EM64L-G09RevD.01
frameworkgroup: C1[X(C15H10N2O3)]
method: RPBEPBE
basis: SDD
operation: Freq
keyword: #p
keyword: freq=noraman
keyword: PBEPBE/SDD
title: #p freq=noraman PBEPBE/SDD
converged: YES YES NO NO
title: Mulliken charges:
elementType: O O O N N C C C C C C C C C C C C C C C H H H H H H H H H H
charge: -0.253208 -0.396446 -0.261999 -0.307908 0.060570 0.120908 0.239482 0.138585 -0.148855 0.416329 -0.337498 -0.336637 -0.225232 -0.225697 -0.328771 -0.364045 0.153760 -0.227366 -0.209966 -0.240841 0.279825 0.303827 0.240402 0.238176 0.302699 0.294614 0.229286 0.229626 0.231246 0.385134
chargesum: 0.00000
title: Mulliken charges with hydrogens summed into heavy atoms:
elementType: O O O N N C C C C C C C C C C C C C C C
charge: -0.253208 -0.011312 -0.261999 -0.307908 0.060570 0.120908 0.239482 0.138585 -0.148855 0.416329 -0.057674 -0.032811 0.015170 0.012479 -0.026072 -0.069431 0.153760 0.001920 0.019660 -0.009596
polarizability: 3.25437329e+02 -2.38154353e+00 2.14294049e+02 3.71603763e-02 -5.58413040e+00 7.26068993e+01
1716.lowfreq: -5.7880 0.0004 0.0005 0.0006 2.2286 5.4103 17.7515 32.9492 39.4192
frequency: 17.6190 32.9448 39.4036 91.5290 110.0913 123.1819 175.0990 196.9375 238.8278 276.4253 296.1368 337.7087 347.5111 370.4490 387.8620 404.9282 419.0719 464.3586 484.8101 535.0009 563.4303 571.8194 581.8542 614.5629 630.5639 660.8528 662.6128 684.9196 691.3601 714.3543 727.4532 761.2498 775.8216 794.8272 797.9208 848.3749 850.0059 915.7843 934.8350 961.9602 983.8002 987.8641 998.0072 998.9506 1017.0536 1017.9742 1034.0607 1051.0943 1073.4103 1086.8260 1105.0613 1149.9470 1174.6257 1179.4006 1190.7222 1214.3487 1254.2434 1270.2645 1284.0291 1325.2128 1365.6519 1385.6850 1399.8576 1430.9873 1445.0277 1471.7279 1476.5259 1508.8198 1567.3382 1592.7159 1601.5524 1606.3440 1614.2927 1620.3507 3132.3370 3139.7981 3145.3498 3156.4799 3163.8385 3173.0951 3188.0586 3190.1823 3217.8696 3512.4080
redmass: 4.1068 7.6855 9.3331 6.4210 5.3984 5.7018 5.3735 5.9928 5.9142 6.7803 6.0378 8.4263 8.3678 6.2706 8.9921 2.9815 3.5461 4.2566 8.4816 3.2821 1.9735 7.8032 5.5599 6.3263 2.0002 8.2997 5.8153 4.3689 2.2090 7.7991 4.5339 3.9995 2.0773 4.7649 1.5453 1.2871 5.8289 1.4161 1.4143 8.1530 1.5693 3.8866 1.3683 1.3191 1.4595 3.4580 2.1577 3.0838 2.6128 1.9193 1.9628 2.5612 1.0496 1.0820 1.2395 2.1062 4.2821 2.1557 2.0191 1.3291 4.0326 9.5256 11.1769 2.5402 2.3481 2.4656 2.4851 7.8140 7.6210 6.6667 8.2257 6.5376 6.8180 8.7467 1.0856 1.0871 1.0912 1.0918 1.0982 1.0976 1.0950 1.0958 1.0942 1.0639
irintensity: 0.1457 0.3753 4.7109 0.1882 0.1714 0.4139 0.3732 2.3882 0.1876 5.8990 1.1918 4.2574 1.7536 1.1175 12.0589 1.6775 2.3015 3.1383 1.7077 27.4586 14.7858 7.0115 53.7187 0.5295 140.4501 2.7516 14.7786 3.3104 51.3952 20.7431 1.6184 25.4348 63.9877 19.3193 51.3428 2.9073 6.9754 0.5927 8.9028 163.4543 3.4909 1.1141 4.0820 2.2691 2.9111 21.5171 16.3271 127.2216 100.6498 43.1200 80.4679 31.0956 0.2564 3.7369 12.9366 4.9689 37.0627 24.4414 35.6919 2.4706 113.9448 4.7823 23.8462 23.0196 17.0015 10.5427 113.3583 25.5169 23.4740 9.2611 177.1388 40.2749 117.0923 161.6399 0.0761 7.0044 20.8853 11.2472 36.2477 12.5160 4.9034 13.5894 7.3518 49.7957
temp: 298.150 k
press: 1.00000 atm
elementType: 8 8 8 7 7 6 6 6 6 6 6 6 6 6 6 6 6 6 6 6 1 1 1 1 1 1 1 1 1 1
symmnumber: 1
zpe: 571800.9 jmol-1
zpe.correction: 0.217787 hartree
zpe.thermalcorrener: 0.233342 hartree
zpe.thermalcorrenthalpy: 0.234286 hartree
zpe.thermalcorrgfe: 0.172895 hartree
zpe.sumelectzpe: -911.405716 hartree
zpe.sumelectthermal: -911.390162 hartree
zpe.sumelectthermalent: -911.389218 hartree
zpe.sumelectthermalfe: -911.450608 hartree
dipole: 0.8208 0.7021 -0.0042
dipole: 1.0802
quadrupole: -96.3944 -105.9900 -118.1136
quadrupole: -9.5853 -1.2504 -3.0848
quadrupole: 10.4383 0.8427 -11.2809 -9.5853 -1.2504 -3.0848
hfenergy: -911.6235033 hartree
pointgroup: C01 [X(C15H10N2O3)]
dipole: -0.3254968 -0.2719816 -0.0261392 debye
polarizability: 325.383342|-3.4147006|212.2278235|-0.1832841|18.0882624|74.7271115 unknown
InChI: InChI=1S/C15H10N2O3/c18-14-12-9-5-4-8-11(12)13(15(19)20)16-17(14)10-6-2-1-3-7-10/h1-9,19H
charge 0 multiplicity 1
30 atoms
O  0.559455 2.573484 0.079669
O  -0.653498 -3.492137 -0.349502
O  -2.880741 -2.928452 -0.094678
N  0.732018 0.206591 0.007517
N  0.138879 -1.02868 -0.067178
C  -1.481456 1.282427 0.040168
C  -2.100454 -0.008683 -0.017445
C  -0.012965 1.446585 0.046093
C  -1.191493 -1.15052 -0.08225
C  2.193216 0.141937 -0.00829
C  -2.275194 2.457792 0.09111
C  -3.525238 -0.090656 -0.017188
C  -3.67507 2.361161 0.088534
C  -4.29536 1.083124 0.035482
C  2.999247 1.228015 0.4193
C  2.800435 -1.065384 -0.443494
C  -1.678864 -2.56351 -0.167074
C  4.4056 1.094561 0.399962
C  4.204225 -1.177778 -0.458506
C  5.017779 -0.099491 -0.037986
H  -1.761536 3.423062 0.131218
H  -3.999799 -1.072936 -0.054411
H  -4.288562 3.267244 0.12814
H  -5.388294 1.009601 0.035418
H  2.541767 2.161893 0.741939
H  2.167106 -1.900838 -0.748534
H  5.0204 1.938386 0.731466
H  4.662073 -2.112117 -0.801031
H  6.109261 -0.190069 -0.052816
H  -1.067434 -4.397507 -0.384133
