program: Gaussian 09
title: 000230838
version: EM64L-G09RevD.01
frameworkgroup: C1[X(C10H10Cl5O3PS)]
method: RPBEPBE
basis: SDD
operation: Freq
keyword: #p
keyword: freq=noraman
keyword: PBEPBE/SDD
title: #p freq=noraman PBEPBE/SDD
converged: YES YES NO NO
title: Mulliken charges:
elementType: Cl Cl Cl Cl Cl S P O O O C C C C C C C C C C H H H H H H H H H H
charge: 0.046106 0.079710 0.060099 0.059271 0.065531 -0.208444 0.873344 -0.449464 -0.466019 -0.463606 0.662059 -0.222109 -0.213857 -0.287324 -0.280355 -0.058923 -0.073646 -0.114287 -0.651037 -0.652740 0.232393 0.232494 0.234817 0.226482 0.215262 0.228128 0.238868 0.211433 0.236478 0.239336
chargesum: 0.00000
title: Mulliken charges with hydrogens summed into heavy atoms:
elementType: Cl Cl Cl Cl Cl S P O O O C C C C C C C C C C
charge: 0.046106 0.079710 0.060099 0.059271 0.065531 -0.208444 0.873344 -0.449464 -0.466019 -0.463606 0.662059 0.242779 0.247443 -0.287324 -0.280355 -0.058923 -0.073646 -0.114287 0.031221 0.034506
polarizability: 2.81744228e+02 -4.16402376e-01 2.44939193e+02 -1.65066594e+01 -2.89474233e+00 1.34298553e+02
1716.lowfreq: -10.7875 0.0015 0.0018 0.0022 3.8187 7.4469 9.5712 25.3690 28.6210
frequency: 7.0282 25.2500 28.5655 30.2953 54.3357 59.1851 63.9041 68.0502 72.2051 78.3175 90.3339 124.6059 150.9393 166.6238 196.3979 201.1790 205.4078 213.0509 215.4032 222.6797 235.6300 255.4192 267.6092 295.9902 299.8118 316.0733 319.1581 327.9989 332.8847 356.4140 401.0820 422.3078 449.3702 517.9007 588.1797 593.2801 609.6947 637.6342 658.0872 690.3108 716.8652 737.7550 775.3397 810.1576 815.0089 821.6354 871.2322 880.8051 930.6289 1011.6176 1019.1948 1070.0548 1104.0417 1106.7353 1131.5858 1135.8284 1233.8340 1257.2232 1257.4254 1315.1739 1337.5779 1352.4329 1354.9914 1357.8901 1395.2396 1397.6463 1456.5244 1458.3408 1476.8554 1478.2598 1486.9986 1487.7202 1520.3162 1538.3955 2993.1253 2995.2788 2998.8269 2999.6496 3062.5280 3069.4042 3093.1065 3096.0953 3111.8177 3115.4684
redmass: 5.8774 3.3270 4.2922 5.8411 4.5116 2.4713 2.9162 7.2762 24.8391 5.3048 30.5505 5.1701 10.4487 10.9574 6.2478 22.2028 10.8476 4.7491 25.9810 2.7096 1.2943 2.0710 6.5868 4.8320 8.4761 12.6328 13.6990 21.1593 7.7316 27.7933 8.6165 6.8189 11.9685 8.8523 12.1274 16.3718 12.9527 12.5576 13.9008 6.2525 7.4951 13.2541 12.0861 1.1014 1.0898 12.6463 4.9904 4.2230 11.3579 2.3958 2.6595 11.8266 2.2462 2.2355 1.4058 1.4455 12.3326 1.1417 1.1411 12.0135 11.9777 4.3625 1.5320 1.2426 1.2391 1.2396 1.0393 1.0401 1.0563 1.0545 1.0783 1.0788 11.9914 11.9932 1.0540 1.0395 1.0543 1.0396 1.1079 1.1059 1.0980 1.0980 1.1027 1.1024
irintensity: 0.1072 0.5937 0.9237 0.7041 0.8735 1.9949 2.0007 0.7175 0.3180 0.8035 0.0737 2.8540 1.0203 0.1442 5.3324 0.0902 1.6494 3.3887 0.1925 3.8151 1.3060 4.1593 6.8293 6.4880 5.0278 0.3485 1.7805 1.4879 6.3368 0.9581 17.2248 3.7399 22.3937 7.2380 0.9450 89.6607 5.2503 23.9068 49.6910 97.2602 74.7571 212.2877 6.1970 2.6482 3.7533 1.7959 229.7604 179.6261 69.5171 129.1745 98.6866 7.5779 10.2808 9.8746 3.9601 4.6973 2.5905 0.1259 0.7106 107.6172 54.8278 313.8366 35.9240 5.6077 24.9380 29.4758 13.3475 12.9776 5.3502 8.1730 9.1096 14.1491 1.6318 3.7226 23.5768 15.3494 27.8431 19.3455 10.6905 4.6600 22.5279 24.6332 31.5300 28.1178
temp: 298.150 k
press: 1.00000 atm
elementType: 17 17 17 17 17 16 15 8 8 8 6 6 6 6 6 6 6 6 6 6 1 1 1 1 1 1 1 1 1 1
symmnumber: 1
zpe: 487389.9 jmol-1
zpe.correction: 0.185637 hartree
zpe.thermalcorrener: 0.210005 hartree
zpe.thermalcorrenthalpy: 0.210949 hartree
zpe.thermalcorrgfe: 0.125969 hartree
zpe.sumelectzpe: -3650.770977 hartree
zpe.sumelectthermal: -3650.746610 hartree
zpe.sumelectthermalent: -3650.745666 hartree
zpe.sumelectthermalfe: -3650.830645 hartree
dipole: 3.7667 0.9122 0.1482
dipole: 3.8784
quadrupole: -146.9868 -155.8437 -173.1174
quadrupole: 0.4128 2.4278 1.2240
quadrupole: 11.6625 2.8056 -14.4681 0.4128 2.4278 1.2240
hfenergy: -3650.9566144 hartree
pointgroup: C01 [X(C10H10Cl5O3P1S1)]
dipole: 1.5207183 -0.1166629 0.0461714 debye
polarizability: 279.2307566|13.786073|231.1322748|18.5839092|-37.5787202|150.6189428 unknown
InChI: InChI=1S/C10H10Cl5O3PS/c1-3-16-19(20,17-4-2)18-10-8(14)6(12)5(11)7(13)9(10)15/h3-4H2,1-2H3
charge 0 multiplicity 1
30 atoms
Cl -0.382759 -2.42183 1.662225
Cl -0.915375 2.596227 -0.588439
Cl -4.02513 2.00444 -1.220001
Cl -3.491499 -3.041046 1.070134
Cl -5.309713 -0.821556 -0.383946
S  1.376217 -0.512619 -2.211688
P  1.827345 0.253171 -0.354539
O  0.484742 0.315448 0.826903
O  3.073231 -0.52078 0.546887
O  2.336845 1.873573 -0.153104
C  -0.833026 0.042607 0.475906
C  3.236675 -2.007866 0.485983
C  3.592105 2.302553 -0.856677
C  -1.413945 -1.197545 0.844951
C  -1.648014 1.01863 -0.155326
C  -3.010137 0.756626 -0.419066
C  -2.776363 -1.464067 0.588874
C  -3.576768 -0.486564 -0.049231
C  4.627823 -2.302943 1.037038
C  3.742053 3.789229 -0.55563
H  2.441591 -2.462292 1.102788
H  3.121615 -2.338342 -0.564193
H  4.434614 1.708089 -0.458656
H  3.475823 2.106495 -1.939942
H  4.795937 -3.395726 1.047137
H  5.408327 -1.835198 0.413355
H  4.727682 -1.926405 2.068908
H  4.656857 4.176027 -1.0415
H  2.875643 4.354611 -0.9373
H  3.822703 3.960053 0.530753
