program: Gaussian 09
title: 000230799
version: EM64L-G09RevD.01
frameworkgroup: C1[X(C17H14N2O2)]
method: RPBEPBE
basis: SDD
operation: Freq
keyword: #p
keyword: freq=noraman
keyword: PBEPBE/SDD
title: #p freq=noraman PBEPBE/SDD
converged: YES YES NO NO
title: Mulliken charges:
elementType: O O N N C C C C C C C C C C C C C C C C C H H H H H H H H H H H H H H
charge: -0.288643 -0.261442 -0.057136 0.003353 0.275453 0.164626 -0.116653 0.071389 -0.388328 -0.359963 0.320472 -0.323428 0.185289 -0.247988 -0.227965 -0.290678 -0.475130 -0.255676 -0.185454 -0.353656 -0.663221 0.270503 0.301170 0.264684 0.233150 0.235178 0.289725 0.240514 0.226717 0.236655 0.231739 0.244617 0.221164 0.249656 0.229307
chargesum: 0.00000
title: Mulliken charges with hydrogens summed into heavy atoms:
elementType: O O N N C C C C C C C C C C C C C C C C C
charge: -0.288643 -0.261442 -0.057136 0.003353 0.275453 0.164626 -0.116653 0.071389 -0.117825 -0.058793 0.320472 -0.058744 0.185289 -0.014839 0.007213 -0.000953 -0.234616 0.207697 0.046285 -0.109039 0.036906
polarizability: 3.10691002e+02 3.81431748e+01 2.72564696e+02 -3.21536360e+00 7.20270796e+00 8.93798887e+01
1716.lowfreq: -7.4299 -5.3035 -0.0004 -0.0002 0.0003 3.0068 8.8345 26.9148 49.3096
frequency: 7.5017 26.7537 49.3083 60.2094 72.2716 90.3261 114.4406 154.3033 170.8068 187.9605 217.2294 250.5839 274.5349 291.6872 322.0660 343.8612 368.5652 384.8038 410.4411 437.1105 459.1981 516.6015 521.7812 562.3784 563.1430 586.5508 610.0737 655.7872 686.2991 709.6130 715.8217 731.2045 746.6940 786.6976 789.2238 796.5236 822.0135 830.9136 850.2194 878.1020 895.5449 916.5367 942.0860 956.6600 961.5889 984.3353 999.5859 1008.5734 1012.1768 1015.9762 1022.8213 1027.5011 1075.5705 1094.8317 1105.1600 1114.8052 1149.3144 1155.7327 1181.0962 1195.6060 1229.8019 1255.1225 1279.6001 1282.8995 1312.8186 1319.3920 1337.1076 1348.4022 1357.6240 1381.0046 1391.9627 1402.5766 1418.8243 1447.4913 1457.6687 1463.7378 1471.5818 1484.2132 1506.6385 1533.5732 1553.1957 1574.9891 1583.7115 1615.2764 1619.0597 2994.5521 3033.1313 3089.8405 3095.9130 3121.6252 3131.1799 3134.2034 3134.6882 3151.4853 3155.1267 3170.8281 3174.5024 3188.4520 3201.1154
redmass: 4.3852 4.9252 3.7867 5.1415 4.7443 3.9358 4.6338 2.8891 4.7509 4.2764 1.3585 4.8980 4.8500 4.9168 3.5159 4.7886 8.5992 3.1056 3.8107 3.4616 4.0514 6.4181 4.4691 4.9069 6.6125 6.6537 7.6918 6.7125 3.3726 5.1560 2.0092 4.1974 4.6961 1.6084 2.1005 3.4912 1.7562 1.6500 6.0263 5.5231 1.5396 1.5160 1.4968 1.4789 4.2062 1.3543 3.9591 1.3231 1.3705 3.3439 3.7619 2.3386 2.5086 2.1891 1.6412 2.5622 1.5804 1.6622 1.3646 1.3367 2.0391 1.6647 1.1184 3.1495 5.2020 3.0287 1.9986 2.4872 1.3776 4.1240 1.2309 2.0139 2.8765 2.5741 1.1076 1.0441 2.5883 1.0530 3.7607 6.6358 6.1846 7.0081 5.9570 8.4299 6.6497 1.0361 1.0593 1.0974 1.1032 1.1063 1.0877 1.0913 1.0867 1.0914 1.0929 1.0980 1.0985 1.0954 1.0909
irintensity: 2.6427 1.0574 1.0503 0.3467 0.4113 0.9180 1.7756 0.1304 1.1772 4.2858 2.6374 1.0847 0.6613 1.1199 13.4091 8.9058 2.1060 1.5384 4.7407 1.7774 0.1541 3.2099 9.9630 0.4989 0.3697 9.2517 5.6620 8.2350 3.3955 1.4415 31.7252 3.1113 4.6259 71.1969 25.0196 2.1238 1.3619 40.2995 1.1242 12.4249 0.0279 0.3183 14.6970 0.4017 27.7640 4.2694 7.9697 0.8777 0.9216 108.4374 23.6693 7.1377 8.3897 60.0856 37.7986 131.1527 125.4486 30.9935 58.3580 12.1958 102.2961 43.6237 3.1490 7.2239 24.5402 14.5611 27.0219 5.7024 16.5922 13.4197 23.7068 5.4847 24.8653 2.0866 24.1336 13.8143 36.2345 14.3573 19.3104 54.3263 14.1746 91.1366 1.0232 73.2333 5.5585 19.5896 32.7765 37.5245 1.1026 25.3784 25.8876 7.3720 5.9136 17.2147 19.9579 16.6553 18.0841 16.9363 0.2609
temp: 298.150 k
press: 1.00000 atm
elementType: 8 8 7 7 6 6 6 6 6 6 6 6 6 6 6 6 6 6 6 6 6 1 1 1 1 1 1 1 1 1 1 1 1 1 1
symmnumber: 1
zpe: 707435.8 jmol-1
zpe.correction: 0.269448 hartree
zpe.thermalcorrener: 0.287101 hartree
zpe.thermalcorrenthalpy: 0.288046 hartree
zpe.thermalcorrgfe: 0.220638 hartree
zpe.sumelectzpe: -914.713481 hartree
zpe.sumelectthermal: -914.695828 hartree
zpe.sumelectthermalent: -914.694884 hartree
zpe.sumelectthermalfe: -914.762291 hartree
dipole: 1.3043 0.5918 0.2629
dipole: 1.4562
quadrupole: -115.4564 -105.5982 -125.4211
quadrupole: -12.9858 -1.5613 0.7367
quadrupole: 0.0355 9.8937 -9.9292 -12.9858 -1.5613 0.7367
hfenergy: -914.9829292 hartree
pointgroup: C01[X(C17H14N2O2)]
dipole: 0.5128726 -0.2367611 -0.0956241 debye
polarizability: 311.081284|-37.7802786|272.4763517|2.711112|-3.4790581|89.0779516 unknown
InChI: InChI=1S/C17H14N2O2/c1-2-21-17(20)14-10-16(12-6-5-9-18-11-12)19-15-8-4-3-7-13(14)15/h3-11H,2H2,1H3
charge 0 multiplicity 1
35 atoms
O  2.087745 2.440543 0.128383
O  3.760593 0.830989 0.012219
N  -0.880679 -1.587016 -0.005188
N  -4.047861 2.135173 -0.023347
C  1.599569 -1.285029 0.04489
C  1.391353 0.148425 0.038849
C  0.399317 -2.108626 0.022397
C  -1.043747 -0.241349 -0.009787
C  0.082193 0.646193 0.011348
C  2.874758 -1.939283 0.074403
C  -2.446396 0.264349 -0.040624
C  0.518172 -3.536669 0.029614
C  2.537715 1.119611 0.053626
C  2.954987 -3.335276 0.081394
C  1.774329 -4.142328 0.058799
C  -3.529632 -0.653995 -0.116302
C  -2.773269 1.648514 0.005073
C  3.138385 3.506152 0.117178
C  -4.850848 -0.169565 -0.146024
C  -5.066367 1.228471 -0.099378
C  3.507753 3.886099 -1.319176
H  -0.059092 1.727174 0.003858
H  3.77885 -1.327778 0.087497
H  -0.408752 -4.117568 0.012415
H  3.937973 -3.818537 0.104186
H  1.8609 -5.234257 0.064761
H  -3.300972 -1.722971 -0.148639
H  -1.994972 2.416599 0.071107
H  2.662826 4.339321 0.658577
H  4.016312 3.136912 0.675186
H  -5.702035 -0.855267 -0.204721
H  -6.078774 1.647429 -0.122329
H  4.219771 4.732073 -1.306214
H  3.988778 3.040756 -1.838805
H  2.614617 4.196428 -1.888225
