program: Gaussian 09
title: 000230789
version: EM64L-G09RevD.01
frameworkgroup: C1[X(C14H14O2)]
method: RPBEPBE
basis: SDD
operation: Freq
keyword: #pfreq=noraman
keyword: PBEPBE/SDD
title: #p freq=noraman PBEPBE/SDD
converged: YES YES NO NO
title: Mulliken charges:
elementType: O O C C C C C C C C C C C C C C H H H H H H H H H H H H H H
charge: -0.263208 -0.224642 0.262826 0.219697 0.186012 0.165109 -0.400487 0.079421 -0.376980 -0.396988 -0.393788 -0.506809 -0.265544 -0.236039 -0.687997 -0.531532 0.270119 0.249232 0.245823 0.274840 0.239135 0.244657 0.229180 0.231760 0.253832 0.220586 0.209098 0.247429 0.228191 0.227066
chargesum: 0.00000
title: Mulliken charges with hydrogens summed into heavy atoms:
elementType: O O C C C C C C C C C C C C C C
charge: -0.263208 -0.224642 0.262826 0.219697 0.186012 0.165109 -0.130368 0.079421 -0.127748 -0.151165 -0.118948 -0.023016 -0.036364 -0.004280 -0.004481 0.171153
polarizability: 2.24777807e+02 -2.34727378e-01 1.95159387e+02 3.61044941e+00 1.46097670e+00 8.02217668e+01
1716.lowfreq: -9.5281 -4.1808 0.0003 0.0004 0.0005 7.4777 38.5357 72.4538 88.0074
frequency: 38.5175 72.4511 87.9999 93.1694 134.5076 178.6122 186.6890 201.9990 212.6192 232.9593 256.2966 283.4756 320.1718 343.0558 397.4442 423.8555 462.5077 472.6052 510.5551 539.3013 587.9149 620.1094 640.8948 655.9598 697.9553 733.5457 777.3649 786.4667 794.5937 805.3215 830.8802 884.5386 902.1393 948.1693 957.9813 971.5880 997.4489 1001.7059 1029.7052 1042.5770 1062.8692 1074.8687 1109.2714 1112.8718 1150.2669 1158.9041 1179.3833 1197.9918 1230.0531 1244.3569 1257.4181 1282.4141 1322.5821 1360.8004 1382.6582 1387.9981 1414.5430 1433.7057 1438.3988 1457.7184 1467.3364 1467.6508 1473.5703 1475.7823 1486.6339 1520.9754 1551.2097 1579.7826 1595.0737 1626.4398 2969.2557 2984.3182 2991.0305 3061.5408 3067.7515 3079.1769 3100.8950 3131.0318 3131.8036 3148.5547 3150.0580 3172.4926 3172.8670 3178.6737
redmass: 4.0002 4.3125 3.0134 3.4573 3.7215 3.3893 3.4640 1.8320 1.6921 1.2422 3.4874 3.0664 5.9786 4.6043 4.4176 3.2001 6.1195 3.3697 5.9024 3.6091 4.5522 3.4051 4.2086 3.8540 5.5757 3.3164 1.5381 4.0829 1.4264 2.3795 1.5048 1.6701 3.9417 4.6855 1.4333 1.3763 1.3829 2.9993 2.3693 1.9032 1.9720 3.5873 2.0862 1.2598 1.4538 1.5394 1.1098 1.4669 1.5544 2.2840 1.5422 1.7095 1.7947 4.6601 1.6015 1.4965 9.1918 1.4365 2.0351 2.1707 1.0862 1.0543 1.1024 1.0486 1.0611 3.9409 7.8370 6.1288 7.5134 6.6375 1.0324 1.0366 1.0651 1.1043 1.0943 1.0999 1.1001 1.0863 1.1002 1.0886 1.0912 1.0937 1.0942 1.0978
irintensity: 2.8506 1.2123 2.8780 3.3594 6.1718 4.2210 1.5897 0.9906 0.4865 1.9062 1.9245 5.2681 1.8086 0.9911 4.1870 4.4806 3.6429 0.2907 3.6545 13.0366 12.6623 2.1455 4.3084 1.1653 13.6959 0.9475 81.5731 12.3258 7.3763 1.0158 41.8298 0.9940 18.8992 6.4478 12.1236 1.7528 1.2991 16.7286 26.2044 34.7028 6.6989 90.4405 15.2733 0.0837 1.3505 3.9120 0.4645 44.1192 78.8363 161.2589 99.4041 1.9617 57.4429 43.3864 40.4743 4.2954 4.0042 9.6414 10.5543 30.4701 19.5080 10.3254 34.7637 13.1051 18.1212 83.2691 187.9858 114.6576 40.5541 7.3202 70.6549 33.5161 11.8352 39.7642 12.9910 48.6273 23.6556 4.4253 20.8883 1.1788 16.3917 3.7386 20.9964 14.8141
temp: 298.150 k
press: 1.00000 atm
elementType: 8 8 6 6 6 6 6 6 6 6 6 6 6 6 6 6 1 1 1 1 1 1 1 1 1 1 1 1 1 1
symmnumber: 1
zpe: 633773.4 jmol-1
zpe.correction: 0.241392 hartree
zpe.thermalcorrener: 0.255940 hartree
zpe.thermalcorrenthalpy: 0.256885 hartree
zpe.thermalcorrgfe: 0.199821 hartree
zpe.sumelectzpe: -691.183907 hartree
zpe.sumelectthermal: -691.169358 hartree
zpe.sumelectthermalent: -691.168414 hartree
zpe.sumelectthermalfe: -691.225477 hartree
dipole: 3.2867 1.0049 1.4428
dipole: 3.7275
quadrupole: -81.1032 -88.4113 -98.6775
quadrupole: -16.1057 -4.0324 -4.0638
quadrupole: 8.2941 0.9861 -9.2802 -16.1057 -4.0324 -4.0638
hfenergy: -691.4252985 hartree
pointgroup: C01[X(C14H14O2)]
dipole: -1.3291238 -0.3062028 0.5387662 debye
polarizability: 224.6251868|-2.551026|195.3563355|-1.6440702|2.3254354|80.1774392 unknown
InChI: InChI=1S/C14H14O2/c1-3-13(15)11-8-9-14(16-2)12-7-5-4-6-10(11)12/h4-9H,3H2,1-2H3
charge 0 multiplicity 1
30 atoms
O  -3.348411 0.652562 0.360498
O  2.936166 2.009462 -0.278864
C  0.211244 -0.453282 0.170979
C  0.901143 0.822764 0.206259
C  -1.237309 -0.474461 0.226523
C  -1.959422 0.776167 0.287124
C  0.140963 2.005228 0.207119
C  2.390242 1.009153 0.281761
C  0.883183 -1.711682 0.006623
C  -1.27745 2.000342 0.254717
C  -1.940908 -1.720049 0.188114
C  3.259261 0.091191 1.156804
C  0.176033 -2.916355 -0.038209
C  -1.247102 -2.92626 0.069363
C  4.467024 -0.494305 0.384044
C  -4.146936 1.882694 0.392518
H  0.680048 2.958251 0.19358
H  1.968174 -1.729291 -0.122764
H  -1.814373 2.952213 0.281054
H  -3.032765 -1.700989 0.239262
H  3.647545 0.744386 1.964366
H  2.664095 -0.698768 1.643217
H  0.717495 -3.859711 -0.169746
H  -1.79165 -3.87593 0.037676
H  5.025163 0.320193 -0.108185
H  5.149675 -1.025974 1.070235
H  4.147654 -1.20692 -0.399296
H  -5.19153 1.54385 0.445057
H  -3.990893 2.481495 -0.52469
H  -3.903758 2.491823 1.283764
