program: Gaussian 09
title: 000230786
version: EM64L-G09RevD.01
frameworkgroup: C1[X(C13H14O3)]
method: RPBEPBE
basis: SDD
operation: Freq
keyword: #pfreq=noraman
keyword: PBEPBE/SDD
title: #p freq=noraman PBEPBE/SDD
converged: YES YES NO NO
title: Mulliken charges:
elementType: O O O C C C C C C C C C C C C C H H H H H H H H H H H H H H
charge: -0.482414 -0.269458 -0.479421 0.261928 0.257024 -0.172875 0.193429 -0.410836 0.156479 -0.417555 -0.384813 -0.392064 -0.389546 -0.266207 -0.239117 -0.532305 0.222768 0.285657 0.233288 0.225730 0.223057 0.239488 0.273558 0.225038 0.228218 0.364714 0.357600 0.242856 0.224012 0.221767
chargesum: 0.00000
title: Mulliken charges with hydrogens summed into heavy atoms:
elementType: O O O C C C C C C C C C C C C C
charge: -0.117700 -0.269458 -0.121820 0.261928 0.257024 0.049893 0.193429 -0.125179 0.156479 -0.184267 0.063974 -0.152576 -0.115988 -0.041168 -0.010898 0.156329
polarizability: 1.96423336e+02 -2.29816775e+00 1.90525687e+02 5.78914688e+00 1.98096846e-01 7.93916724e+01
1716.lowfreq: -0.0008 0.0007 0.0007 8.0942 8.7348 14.0692 57.0827 68.3507 93.6220
frequency: 57.0460 68.2698 93.6078 103.7058 139.5201 172.4194 180.8369 205.2945 226.2100 248.7744 251.5126 295.5489 309.0268 338.8599 400.0853 424.0699 462.8094 468.6060 481.7082 506.1191 518.8911 586.2315 598.9401 617.6392 648.4299 697.4397 752.6721 775.6934 791.0306 799.1854 831.4938 865.5970 879.8330 940.6119 951.3628 965.1773 967.6307 994.3068 1001.2099 1021.5627 1035.5596 1068.2611 1072.3351 1114.3299 1145.4342 1156.5414 1177.2774 1180.8926 1183.4158 1187.7455 1215.4596 1239.3695 1252.9100 1273.3217 1319.0859 1367.5901 1374.6895 1385.2262 1403.2533 1423.9489 1433.2684 1440.3216 1460.8283 1462.8764 1466.7090 1476.0883 1521.1572 1586.8940 1604.1209 1629.8439 2950.8313 2961.1316 2974.6150 3042.6725 3049.4833 3124.4763 3124.7566 3139.7646 3155.1442 3155.5447 3174.2816 3175.4155 3510.5219 3594.5778
redmass: 4.8150 4.8406 3.3414 3.6806 3.6972 3.5335 3.8358 4.3436 2.5399 1.4275 1.1265 5.2762 5.3422 3.9107 4.9509 3.2091 4.9122 3.4658 3.1602 1.3359 3.1032 4.5751 5.3574 3.3192 3.6676 5.6375 3.4935 1.5509 3.4629 3.4825 1.4547 2.8432 1.6866 5.2409 2.3149 1.4615 2.0914 1.3289 3.5189 2.4959 2.2358 2.4766 3.9706 1.2607 1.4474 1.5226 1.1058 1.3875 1.2408 1.2741 1.3657 2.5426 1.4083 1.6177 1.2834 2.1703 2.1673 1.4928 1.9256 6.1820 1.6267 1.8338 1.9193 1.1774 1.0500 1.1227 4.0569 6.3752 6.7893 6.9144 1.0823 1.0328 1.0559 1.1084 1.1039 1.0856 1.0990 1.0899 1.0882 1.0959 1.0971 1.0950 1.0648 1.0669
irintensity: 4.2527 0.7605 3.3423 4.4328 5.6867 2.1117 6.6205 1.2655 3.0443 3.8884 131.5734 5.2284 8.4088 0.4291 4.6966 3.9769 3.9618 0.3251 1.2020 140.9155 54.9392 8.8000 19.9815 5.8990 0.8794 11.4532 16.1636 83.2583 6.1487 7.3523 50.3946 14.5939 0.9159 11.3193 37.2851 9.7172 43.0515 0.6775 20.5040 60.9009 8.1384 45.5993 106.2884 0.1357 6.1233 5.1310 2.9670 40.3436 13.5769 19.5156 13.3339 125.8465 0.9503 20.5351 17.3937 39.7109 13.9843 18.0104 15.3533 12.2367 9.8159 15.6369 65.0279 8.8624 13.5421 11.2469 16.9153 77.5766 3.7607 6.4544 26.0596 73.2759 43.8352 38.3759 46.3757 1.9815 22.1114 20.9735 4.4619 34.3807 17.7171 4.6360 28.9811 7.7306
temp: 298.150 k
press: 1.00000 atm
elementType: 8 8 8 6 6 6 6 6 6 6 6 6 6 6 6 6 1 1 1 1 1 1 1 1 1 1 1 1 1 1
symmnumber: 1
zpe: 630617.1 jmol-1
zpe.correction: 0.240189 hartree
zpe.thermalcorrener: 0.254909 hartree
zpe.thermalcorrenthalpy: 0.255854 hartree
zpe.thermalcorrgfe: 0.198880 hartree
zpe.sumelectzpe: -728.262986 hartree
zpe.sumelectthermal: -728.248266 hartree
zpe.sumelectthermalent: -728.247322 hartree
zpe.sumelectthermalfe: -728.304295 hartree
dipole: 0.0588 -0.3170 2.7235
dipole: 2.7426
quadrupole: -76.7829 -84.4693 -96.0624
quadrupole: -9.3954 -8.6055 -2.8158
quadrupole: 8.9886 1.3023 -10.2909 -9.3954 -8.6055 -2.8158
hfenergy: -728.5031753 hartree
pointgroup: C01 [X(C13H14O3)]
dipole: -0.0122393 0.1768516 1.0643431 debye
polarizability: 196.2752198|-2.6676703|190.2768708|-6.7771704|-5.5366176|79.7886055 unknown
InChI: InChI=1S/C13H14O3/c1-16-13-7-6-10(12(15)8-14)9-4-2-3-5-11(9)13/h2-7,12,14-15H,8H2,1H3
charge 0 multiplicity 1
30 atoms
O  3.030488 1.75977 -0.993565
O  -3.215427 0.930319 0.225696
O  4.644925 0.232019 0.59225
C  0.998503 0.60149 -0.311811
C  0.178749 -0.580422 -0.163074
C  2.509687 0.497218 -0.456365
C  -1.251261 -0.435745 0.025019
C  0.39305 1.859218 -0.294336
C  -1.824263 0.889705 0.042332
C  0.71472 -1.914102 -0.195961
C  3.197097 0.228837 0.899101
C  -1.014151 2.018064 -0.121449
C  -2.072764 -1.597067 0.183001
C  -0.107521 -3.033813 -0.044488
C  -1.513301 -2.876858 0.152673
C  -3.855568 2.246582 0.239487
H  2.780829 -0.330408 -1.146628
H  1.027833 2.737626 -0.4387
H  1.787568 -2.062697 -0.358904
H  2.939788 1.044048 1.605154
H  2.880666 -0.744811 1.320254
H  -1.436855 3.02666 -0.122932
H  -3.147694 -1.45537 0.324362
H  0.326674 -4.039309 -0.081199
H  -2.149539 -3.760342 0.273524
H  4.016701 1.719239 -0.870829
H  5.172385 0.190556 1.427046
H  -4.925914 2.045287 0.393093
H  -3.707548 2.773839 -0.72289
H  -3.46896 2.871965 1.067537
