program: Gaussian 09
title: 000230785
version: EM64L-G09RevD.01
frameworkgroup: C1[X(C13H13NO3)]
method: RPBEPBE
basis: SDD
operation: Freq
keyword: #p
keyword: freq=noraman
keyword: PBEPBE/SDD
title: #p freq=noraman PBEPBE/SDD
converged: YES YES NO NO
title: Mulliken charges:
elementType: O O O N C C C C C C C C C C C C C H H H H H H H H H H H H H
charge: -0.258348 -0.284950 -0.257781 -0.041122 0.269115 -0.077147 0.195558 -0.415694 0.093268 -0.365195 -0.314504 -0.254907 -0.226548 0.189859 -0.226130 -0.680952 -0.497811 0.293530 0.297832 0.259428 0.230201 0.231512 0.224725 0.224822 0.209467 0.229359 0.229362 0.235159 0.243865 0.244026
chargesum: 0.00000
title: Mulliken charges with hydrogens summed into heavy atoms:
elementType: O O O N C C C C C C C C C C C C C
charge: -0.258348 -0.284950 -0.257781 -0.041122 0.269115 -0.077147 0.195558 -0.122164 0.093268 -0.067363 -0.055076 -0.024706 0.004964 0.189859 0.223418 -0.012765 0.225240
polarizability: 2.12325158e+02 1.69831397e+01 2.18136989e+02 -4.14509703e-02 -2.29463912e-02 7.58174160e+01
1716.lowfreq: -7.3281 -0.0002 0.0006 0.0008 2.2279 3.4992 20.4553 44.8532 76.8980
frequency: 20.4428 44.7470 76.8811 93.7583 96.3436 103.1532 136.4789 150.9043 169.5742 212.0948 251.6984 263.5014 293.1194 308.9045 311.5443 359.8771 373.8042 420.1075 489.1736 520.4833 531.1035 550.1386 590.7004 655.4470 672.8851 710.1237 729.8525 749.4622 784.0878 790.8004 801.0606 814.9030 857.4412 891.0211 900.4764 925.4279 979.1016 986.1719 998.7549 1004.7603 1027.5116 1034.0452 1105.4341 1113.2298 1115.0219 1136.1169 1146.8928 1148.4072 1180.9744 1186.4028 1245.4884 1252.3049 1288.8998 1307.9065 1346.7299 1370.3257 1386.4084 1398.7211 1415.2633 1424.6483 1451.9742 1453.2337 1462.6985 1463.2001 1472.7968 1487.1242 1504.6615 1545.5343 1581.8318 1618.8112 1621.6451 2994.5951 3005.2917 3005.3902 3062.6263 3091.7873 3105.2458 3107.2369 3132.7638 3150.5306 3150.6091 3168.7735 3186.4442 3206.7095
redmass: 6.0771 3.1103 2.5571 2.2623 3.7257 1.2497 3.5078 3.9506 4.5832 2.7664 1.4506 5.3736 4.4066 3.8441 5.8752 5.8676 7.6888 3.6458 5.6190 4.2741 7.2932 4.6854 6.1053 6.8154 3.7796 5.8447 5.3786 5.3851 1.4837 3.4438 1.0995 6.5351 3.7137 1.5293 7.2341 1.4878 1.3547 4.9413 7.1168 1.3129 2.4218 2.3305 2.4989 2.2127 1.2620 1.4646 1.4130 1.7595 1.2622 2.0577 1.1335 1.8258 2.4880 3.0956 2.5646 2.3752 4.5387 1.3166 2.7304 1.2060 1.0495 3.0285 1.0405 1.0543 1.0710 1.0828 4.2025 7.5910 7.7823 6.2562 9.7160 1.0358 1.0350 1.0523 1.1064 1.0986 1.1022 1.1045 1.0863 1.1048 1.0914 1.0978 1.0954 1.0926
irintensity: 1.5442 0.9577 1.7129 0.9423 2.0661 0.3370 0.7058 0.3097 0.1590 12.7244 4.8431 2.4818 5.7907 13.9728 0.1285 2.3637 7.1305 2.3382 7.2538 10.0061 2.3258 0.2176 4.0252 9.3166 1.3230 12.4920 0.0825 0.9396 88.3799 10.2053 5.8297 14.2420 9.7239 0.0617 1.5242 19.9608 4.0944 25.3670 63.6170 0.7611 69.9762 67.1369 79.3090 6.1671 0.0674 4.7079 1.2022 198.7615 15.1548 254.3622 0.0100 99.6780 64.5331 206.8699 41.4238 48.2112 43.7664 16.0653 4.5380 31.0401 14.6343 18.6357 11.7370 15.6350 8.4151 14.5422 24.0972 136.1724 174.5455 17.0966 43.3466 27.4375 53.9275 1.0937 10.1339 28.4618 43.7855 26.3849 6.3981 15.5353 16.5503 16.4872 16.4648 2.4432
temp: 298.150 k
press: 1.00000 atm
elementType: 8 8 8 7 6 6 6 6 6 6 6 6 6 6 6 6 6 1 1 1 1 1 1 1 1 1 1 1 1 1
symmnumber: 1
zpe: 611785.6 jmol-1
zpe.correction: 0.233017 hartree
zpe.thermalcorrener: 0.248858 hartree
zpe.thermalcorrenthalpy: 0.249802 hartree
zpe.thermalcorrgfe: 0.188303 hartree
zpe.sumelectzpe: -782.387771 hartree
zpe.sumelectthermal: -782.371930 hartree
zpe.sumelectthermalent: -782.370986 hartree
zpe.sumelectthermalfe: -782.432485 hartree
dipole: -0.7751 -1.0436 -0.0109
dipole: 1.2999
quadrupole: -89.0231 -83.2639 -101.0592
quadrupole: -5.6384 -0.0543 -0.0133
quadrupole: 2.0923 7.8515 -9.9438 -5.6384 -0.0543 -0.0133
hfenergy: -782.6207875 hartree
pointgroup: C01 [X(C13H13N1O3)]
dipole: 0.3039852 -0.4084791 0.048005 debye
polarizability: 212.2467522|-16.8312975|216.6736991|2.2102411|-14.7291278|77.3591115 unknown
InChI: InChI=1S/C13H13NO3/c1-3-17-12-8-10(13(15)16-2)9-6-4-5-7-11(9)14-12/h4-8H,3H2,1-2H3
charge 0 multiplicity 1
30 atoms
O  2.682581 -1.194581 0.233356
O  -1.947426 -2.628475 0.373607
O  -3.359234 -0.802261 0.164567
N  1.602376 0.896783 0.011941
C  -0.897626 0.9708 -0.002611
C  0.408474 1.6064 -0.065204
C  -0.911536 -0.476671 0.147302
C  0.301036 -1.166665 0.222446
C  1.528155 -0.431069 0.150037
C  -2.062337 1.800319 -0.091058
C  0.499751 3.025055 -0.212825
C  -1.941053 3.187095 -0.234964
C  -0.65591 3.80586 -0.296735
C  -2.189949 -1.258339 0.222925
C  3.978497 -0.46231 0.162854
C  5.07502 -1.516131 0.281181
C  -3.155361 -3.481512 0.455714
H  0.32773 -2.250852 0.334402
H  -3.046568 1.330194 -0.044296
H  1.50101 3.464111 -0.256278
H  -2.84371 3.804297 -0.300796
H  -0.578084 4.892873 -0.409681
H  4.019802 0.089805 -0.793981
H  4.009321 0.278655 0.982621
H  6.066928 -1.030622 0.235146
H  4.997348 -2.059672 1.238421
H  5.007618 -2.249049 -0.541102
H  -2.767443 -4.502578 0.575183
H  -3.753172 -3.386575 -0.466289
H  -3.774438 -3.185585 1.31922
