program: Gaussian 09
title: 000230782
version: EM64L-G09RevD.01
frameworkgroup: C1[X(C12H11ClO)]
method: RPBEPBE
basis: SDD
operation: Freq
keyword: #p
keyword: freq=noraman
keyword: PBEPBE/SDD
title: #p freq=noraman PBEPBE/SDD
converged: YES YES NO NO
title: Mulliken charges:
elementType: Cl O C C C C C C C C C C C C H H H H H H H H H H H
charge: -0.080807 -0.427766 0.504457 0.179134 -0.248737 0.428643 -0.323748 -0.377790 -0.458173 -0.697445 -0.261075 -0.426539 -0.260162 -0.242428 0.226664 0.222314 0.246798 0.224314 0.230309 0.241165 0.258615 0.242964 0.231217 0.233457 0.334618
chargesum: 0.00000
title: Mulliken charges with hydrogens summed into heavy atoms:
elementType: Cl O C C C C C C C C C C C C
charge: -0.080807 -0.093147 0.504457 0.179134 -0.022073 0.428643 -0.323748 -0.155476 -0.211375 -0.001657 -0.002460 -0.183575 -0.028945 -0.008971
polarizability: 2.08471274e+02 1.20934511e+01 1.54028836e+02 -1.81800899e-01 1.69276755e+00 6.89884530e+01
1716.lowfreq: -7.5502 -4.9482 0.0023 0.0023 0.0028 4.1207 57.6922 70.9602 116.0776
frequency: 57.5954 70.9567 116.0679 182.8738 202.0794 216.3843 235.6238 249.3408 282.8114 335.8472 345.7700 408.5866 422.6237 431.6491 464.4987 507.8259 520.7386 571.6038 577.2870 625.2070 672.7607 709.4342 751.3944 793.3369 813.4623 816.5554 823.7811 871.4384 880.8644 952.7602 969.9585 980.9461 993.8138 1001.0930 1036.4501 1067.7710 1079.6498 1122.3089 1155.2730 1181.9974 1196.8510 1230.4509 1255.3836 1267.4192 1294.0688 1336.7754 1382.1639 1394.7914 1404.6243 1425.5198 1429.0154 1443.4532 1463.6314 1475.8019 1512.3338 1582.4463 1587.9123 1626.2542 2985.7534 3078.7281 3086.7881 3104.6527 3124.8143 3136.9664 3138.6504 3156.0976 3170.0283 3173.3614 3517.3547
redmass: 4.1724 4.1658 4.7966 3.7787 1.8201 5.8734 1.8803 4.7452 5.4126 6.9798 5.0047 1.9225 1.6634 3.1276 2.8211 3.7339 5.5458 3.2167 6.0954 5.1153 4.1670 4.0427 1.3154 2.7994 3.5560 1.4797 6.3255 2.7338 1.8339 1.3370 1.4092 2.9525 1.3701 1.9393 2.2926 3.0916 1.7930 2.1146 1.3332 1.1305 1.8003 2.1143 1.6539 1.4482 1.4848 2.3926 1.2123 2.1100 2.9805 2.9211 1.6289 2.2946 1.0662 1.0595 3.3762 8.0666 6.1884 6.3416 1.0353 1.0946 1.0956 1.0936 1.0867 1.0892 1.0890 1.0943 1.0987 1.0966 1.0650
irintensity: 0.7032 1.0819 0.3576 2.0496 0.3695 0.6321 0.1913 1.2082 1.8523 4.0951 5.3511 73.7439 57.9618 12.8814 72.6137 0.0827 3.4521 4.6821 16.5427 2.3047 6.8024 2.3903 27.7426 16.6314 16.5466 54.2843 32.8422 4.7222 16.5872 0.0766 1.3315 21.6742 2.0590 23.0244 7.3110 8.8202 147.4566 21.4136 7.0186 1.7824 25.6656 4.4376 18.7497 23.9789 4.6040 7.4481 21.9473 10.3239 2.5462 2.1639 13.5044 7.3267 9.2128 6.3349 22.2318 2.9314 13.4537 4.1384 20.2168 8.8718 19.1813 27.7387 2.0605 1.2711 11.3707 28.5612 26.1376 4.7113 16.5654
temp: 298.150 k
press: 1.00000 atm
elementType: 17 8 6 6 6 6 6 6 6 6 6 6 6 6 1 1 1 1 1 1 1 1 1 1 1
symmnumber: 1
zpe: 511299.0 jmol-1
zpe.correction: 0.194743 hartree
zpe.thermalcorrener: 0.207036 hartree
zpe.thermalcorrenthalpy: 0.207980 hartree
zpe.thermalcorrgfe: 0.156261 hartree
zpe.sumelectzpe: -998.165997 hartree
zpe.sumelectthermal: -998.153704 hartree
zpe.sumelectthermalent: -998.152760 hartree
zpe.sumelectthermalfe: -998.204480 hartree
dipole: -2.4561 0.9225 1.7156
dipole: 3.1347
quadrupole: -81.7223 -80.9394 -96.8406
quadrupole: 1.5366 2.9064 -3.6662
quadrupole: 4.7785 5.5613 -10.3398 1.5366 2.9064 -3.6662
hfenergy: -998.3607403 hartree
pointgroup: C01 [X(C12H11Cl1O1)]
dipole: -0.9965794 -0.3124814 -0.6559077 debye
dipolederiv: -0.8711426 0.1365217 0.0265472 0.0512216 -0.2082451 -0.0169733 0.0234217 -0.0304273 -0.0922035 -0.6634009 -0.2453456 -0.1963191 -0.2447153 -0.5092084 0.15265 -0.1914538 0.0718842 -0.6124826 -0.2647912 0.1550857 -0.0189845 0.0814478 -0.085721 -0.0147027 0.01333 0.03244 -0.0742394 0.1493018 -0.1511699 -0.0147879 -0.1120277 -0.0774875 -0.0047277 -0.0191547 -0.0315701 -0.0043246 0.5061752 0.163329 0.1602486 0.1512536 0.4490153 -0.0958203 0.1562174 -0.0148194 0.5198495 0.0039204 -0.0979397 -0.0040064 -0.0621 -0.0852348 -0.0066227 0.0063393 -0.0013823 0.0793773 1.1686521 -0.1763294 -0.0605525 -0.1512917 0.1148462 0.013942 -0.0503291 0.0320185 -0.0765636 -0.1379927 0.0854585 0.011797 0.0416803 0.0497201 0.0022978 -0.0018716 0.0203099 -0.1419825 0.0427471 0.0620407 -0.0014321 -0.0788396 0.0894236 0.0254968 -0.0117711 0.0134116 -0.1765508 -0.0521333 -0.0764565 0.0675416 -0.0787958 -0.0411294 0.0733962 -0.0113965 0.0126642 -0.158583 -0.3218752 -0.0167383 0.0085662 0.0644179 0.0258066 0.0071938 0.017674 0.0093756 -0.0993861 0.0306415 0.0451475 0.0017742 0.1135773 0.073707 0.0119078 0.0021158 0.0146569 -0.170505 -0.0508567 -0.0561989 -0.0028063 -0.0242891 0.1386529 0.0165166 -0.0089446 0.012789 -0.1533773 0.1084319 0.0586474 0.0016789 0.0394962 -0.0881471 0.0038179 -0.0012527 0.0031943 -0.1577679 0.0075521 0.0967073 0.0245171 0.0682537 -0.0196904 -0.0277538 0.0474123 -0.0213048 0.0034025 0.062537 -0.1024355 -0.0095118 -0.0695017 -0.0522943 -0.0031925 0.001081 -0.0061022 0.1398537 0.0045957 -0.1071323 -0.0023986 -0.0445273 -0.0333313 -0.0107832 0.0003884 -0.0104594 0.156815 -0.0251624 0.0514662 -0.1291622 0.0247205 0.0959263 0.0307329 -0.1019166 0.0092378 -0.0255228 0.0230001 0.0568984 0.0630805 0.123891 0.0011979 -0.0717239 0.0107602 -0.0278245 0.0619232 0.0073292 -0.133467 0.0214288 -0.1359362 -0.0929453 0.0087841 0.0178843 0.0031585 0.0737956 0.0605689 0.0785598 0.0085591 0.0479555 -0.0073711 -0.0105995 0.0036548 -0.016406 0.1619697 0.0310489 -0.0436476 -0.0001315 -0.1166368 -0.0625046 -0.0104692 -0.0054113 -0.0127496 0.1556869 0.0267446 0.0856207 0.007857 0.1001191 -0.0747488 -0.0149022 0.0079736 -0.0140037 0.1578337 -0.1375781 0.0066669 0.0058742 0.0079845 0.0928046 -0.0039027 0.0042338 -0.0022386 0.1629861 0.2916867 0.1247109 0.0306225 0.2026423 0.3069585 -0.054562 0.0910152 -0.0458526 0.269996 unknown
polarizability: 207.4934254|-13.7554359|154.7380407|-4.0140956|4.3750947|69.2570967 unknown
InChI: InChI=1S/C12H11ClO/c1-8(14)12-10-5-3-2-4-9(10)6-7-11(12)13/h2-8,14H,1H3
charge 0 multiplicity 1
25 atoms
Cl 3.25272 -1.204443 -0.17344
O  2.69711 1.539962 1.186046
C  0.841809 0.283309 0.045549
C  -0.613626 0.335334 0.070739
C  1.675329 1.57563 0.128701
C  -1.385148 -0.894635 0.003496
C  1.415628 -0.986352 -0.072819
C  -1.346189 1.570901 0.147065
C  -0.707752 -2.152407 -0.0919
C  2.265751 1.979423 -1.24272
C  0.682108 -2.204061 -0.134442
C  -2.817794 -0.843202 0.028896
C  -2.743167 1.590484 0.165073
C  -3.491937 0.375003 0.108046
H  1.023217 2.389156 0.476474
H  -0.814805 2.52525 0.191915
H  -1.294194 -3.076809 -0.136698
H  1.459895 2.153432 -1.979501
H  2.934446 1.198842 -1.645631
H  2.843775 2.91318 -1.127276
H  1.21689 -3.154217 -0.215339
H  -3.376099 -1.785701 -0.018251
H  -3.270897 2.548559 0.225467
H  -4.586472 0.40619 0.126186
H  3.375306 0.852571 0.953661
