program: Gaussian 09
title: 000230945
version: EM64L-G09RevD.01
frameworkgroup: C1[X(C23H31FO4)]
method: RPBEPBE
basis: SDD
operation: Freq
keyword: #p
keyword: freq=noraman
keyword: PBEPBE/SDD
title: #p freq=noraman PBEPBE/SDD
converged: NO YES NO NO
title: Mulliken charges:
elementType: F O O O O C C C C C C C C C C C C C C C C C C C C C C C H H H H H H H H H H H H H H H H H H H H H H H H H H H H H H H
charge: -0.221073 -0.295558 -0.200452 -0.222664 -0.233992 0.307325 -0.148018 -0.165010 -0.112141 0.242460 -0.525315 0.247106 -0.547688 -0.523838 -0.515868 -0.535407 -0.823918 0.373495 -0.161870 -0.508698 -0.817600 0.136314 -0.552680 -0.517809 0.180228 -0.794563 0.274422 -0.763844 0.259585 0.230842 0.224351 0.237731 0.207120 0.217921 0.238368 0.226825 0.209296 0.279867 0.246145 0.245569 0.239737 0.231861 0.224402 0.257169 0.227050 0.213426 0.222857 0.232120 0.237748 0.220174 0.231353 0.245226 0.290411 0.252626 0.253674 0.274203 0.247827 0.249921 0.251249
chargesum: 0.00000
title: Mulliken charges with hydrogens summed into heavy atoms:
elementType: F O O O O C C C C C C C C C C C C C C C C C C C C C C C
charge: -0.221073 -0.295558 -0.200452 -0.222664 -0.233992 0.307325 0.111568 0.065832 0.112209 0.242460 -0.080464 0.247106 -0.091399 -0.087716 0.010144 -0.050101 -0.110486 0.373495 0.065180 -0.072415 -0.127558 0.136314 -0.076100 -0.227398 0.180228 -0.014060 0.274422 -0.014847
polarizability: 2.95138745e+02 2.34943883e+01 2.41117487e+02 5.35508718e+00 3.18408058e-01 2.16808061e+02
1716.lowfreq: -6.9266 -4.2807 -0.0006 -0.0004 0.0003 11.3990 15.9754 26.9983 36.5450
frequency: 15.7145 26.9662 36.4932 52.6909 74.5328 78.6292 90.8792 98.3430 119.0288 124.2310 145.6905 147.9657 155.2935 159.2159 174.2528 184.2707 208.8760 228.5631 230.4430 238.7836 245.3587 256.5530 267.9624 272.3802 287.8679 311.9792 330.5653 339.4117 344.2620 358.4610 365.0110 375.1567 401.1211 406.5651 416.7694 438.3229 466.7831 473.6475 486.5151 517.0619 520.3846 537.6834 563.7818 567.7962 577.2391 587.3283 591.6730 629.5034 645.7628 665.7903 691.1995 699.1219 730.6437 763.7116 768.1398 812.8886 815.6961 838.7179 853.5583 867.9846 905.2401 913.9660 919.1978 928.5999 929.2482 936.1192 942.6813 959.9373 962.1563 987.2215 989.0013 994.8709 995.0724 1007.1185 1021.1659 1029.7460 1032.9330 1037.5535 1039.4255 1050.6694 1059.2437 1070.9124 1077.6138 1106.6958 1108.4199 1115.6913 1122.8938 1135.6984 1146.7510 1157.3808 1174.1929 1179.6351 1186.5012 1205.9250 1208.9462 1214.8403 1223.5052 1230.2591 1243.3962 1248.3646 1261.3094 1266.0508 1274.5693 1277.3300 1293.7094 1295.7909 1300.4404 1303.0252 1316.5384 1321.4479 1326.5187 1329.8487 1333.7693 1341.4394 1351.0052 1354.2256 1368.7588 1369.7709 1383.1514 1392.0769 1404.9573 1446.5654 1449.3891 1451.0066 1453.9135 1459.6274 1460.8688 1467.8142 1468.7414 1470.3097 1474.5883 1477.8626 1480.7295 1487.9027 1492.7947 1496.8915 1591.5451 1618.5600 1632.7058 1640.0416 2935.6555 2951.8041 2974.3941 2977.1284 2978.6022 2984.8738 2986.3006 2989.1042 2991.0633 2994.6971 2996.3739 2999.9505 3005.0150 3015.4044 3036.0768 3037.4828 3047.0205 3054.1790 3058.1787 3062.3844 3066.2531 3075.4238 3083.0145 3086.4056 3087.0170 3093.8475 3098.1688 3102.9090 3120.5604 3141.8401 3154.9262
redmass: 1.0869 6.2279 4.5939 5.1222 4.2725 3.7115 3.7941 4.7509 3.3734 2.7047 2.3122 5.6867 2.9388 1.5901 3.1101 4.5139 3.3821 2.2220 1.8870 1.4374 2.5197 2.6439 2.4375 2.5637 2.5803 3.0138 2.6586 4.1361 3.1154 4.4853 3.3024 3.6619 3.7442 2.8716 3.4797 3.2379 3.5686 3.1149 3.6796 2.5669 4.1839 3.1314 3.3390 2.7216 3.3577 3.5026 3.6591 4.5508 3.8490 2.8932 3.1703 2.7609 2.9690 2.7314 2.6364 2.2469 2.1623 2.1194 2.6165 2.1418 2.9406 1.5932 2.0862 2.6216 2.5097 1.7420 3.6351 2.2178 1.9401 1.8278 2.1571 2.0226 1.9314 1.9616 2.5464 2.0729 2.0245 2.0359 1.6897 2.1170 2.6096 2.9284 3.0016 2.5934 1.7220 2.5998 2.0671 1.9341 1.6112 2.4432 1.9771 2.2703 1.7496 1.9304 1.9806 2.3366 2.1998 1.6830 1.6885 1.3630 1.6926 1.6003 1.5279 1.4587 1.4103 1.5389 1.3457 1.4610 1.4781 1.4331 1.2839 1.4066 1.3764 1.4554 1.5358 1.6672 1.2592 1.3444 1.2369 1.1928 1.1815 1.0809 1.0670 1.0664 1.0491 1.0635 1.0694 1.0791 1.0895 1.0782 1.0791 1.0759 1.0614 1.0534 1.0781 1.0589 10.3742 9.0106 8.1839 9.3230 1.0811 1.0801 1.0673 1.0693 1.0694 1.0448 1.0593 1.0633 1.0567 1.0363 1.0585 1.0442 1.0376 1.0832 1.1001 1.0623 1.0974 1.1002 1.1011 1.1016 1.0949 1.0993 1.0979 1.0948 1.0982 1.0963 1.1019 1.0992 1.1021 1.1011 1.0910
irintensity: 1.3041 3.1433 1.5869 0.5054 1.7850 0.5268 1.6778 1.6531 5.1299 0.5352 0.1362 1.4374 0.1756 2.0755 2.3856 5.6963 0.8448 0.4965 3.7779 1.1312 5.9304 1.6924 1.0384 4.1290 0.9533 0.5100 0.1479 1.3411 2.0625 0.7917 1.4712 3.4954 5.4495 2.0539 5.9664 0.7453 8.7020 1.2386 3.9100 1.6547 2.5877 5.4948 4.8045 1.4706 9.0901 8.3324 1.3906 8.9465 0.5264 0.5004 8.7411 5.4477 8.6189 2.4606 3.5220 2.1552 0.5419 1.9590 3.7170 2.7054 32.6992 54.7682 12.7032 13.6826 34.9810 2.7560 42.1415 8.8602 28.6881 14.1223 13.9377 0.6655 31.7061 3.1649 12.2444 7.9268 0.2544 15.1677 6.4163 18.6526 2.0107 6.8217 8.2618 1.6077 7.7714 26.5649 12.9512 4.5918 25.8193 8.4784 33.2849 18.9087 38.0723 99.2123 13.7223 122.3572 62.5407 20.5489 41.0103 3.3893 5.5745 11.0819 32.2757 6.0530 11.9571 9.8623 1.7999 2.0792 3.4062 5.7131 4.4035 0.9582 1.1861 2.0584 2.4007 1.8830 55.2870 15.8664 49.9079 19.4181 31.7527 14.6541 9.1639 34.3925 20.2981 8.6599 7.2010 1.8170 8.3887 11.4078 20.1840 6.9306 12.3205 11.2205 10.2475 7.3065 199.6896 90.0991 143.3607 167.0190 7.5167 4.7194 6.1410 16.5219 21.1184 9.2721 16.4275 0.6575 68.8635 2.1779 31.8101 46.6216 1.8306 24.3372 14.5922 7.0905 36.7543 26.7018 32.2186 33.5947 19.3687 29.0234 30.7509 3.9613 38.7564 6.5875 21.8965 10.9577 10.0320 9.3390 0.0470
temp: 298.150 k
press: 1.00000 atm
elementType: 9 8 8 8 8 6 6 6 6 6 6 6 6 6 6 6 6 6 6 6 6 6 6 6 6 6 6 6 1 1 1 1 1 1 1 1 1 1 1 1 1 1 1 1 1 1 1 1 1 1 1 1 1 1 1 1 1 1 1
symmnumber: 1
zpe: 1298269.2 jmol-1
zpe.correction: 0.494485 hartree
zpe.thermalcorrener: 0.522125 hartree
zpe.thermalcorrenthalpy: 0.523069 hartree
zpe.thermalcorrgfe: 0.437155 hartree
zpe.sumelectzpe: -1293.652531 hartree
zpe.sumelectthermal: -1293.624890 hartree
zpe.sumelectthermalent: -1293.623946 hartree
zpe.sumelectthermalfe: -1293.709861 hartree
dipole: -1.7980 -0.2805 -3.4024
dipole: 3.8585
quadrupole: -230.4697 -167.3906 -164.8009
quadrupole: -29.9219 -10.3256 -0.9114
quadrupole: -42.9160 20.1631 22.7529 -29.9219 -10.3256 -0.9114
hfenergy: -1294.1470153 hartree
pointgroup: C01 [X(C23H31F1O4)]
dipole: 0.6541254 0.8975616 1.0348756 debye
polarizability: 294.0710436|-10.7763347|227.8120425|23.0768339|-12.1159139|231.1812072 unknown
InChI: InChI=1S/C23H31FO4/c1-13(25)23(28-14(2)26)10-7-18-16-12-20(24)19-11-15(27)5-8-21(19,3)17(16)6-9-22(18,23)4/h11,16-18,20H,5-10,12H2,1-4H3
charge 0 multiplicity 1
59 atoms
F  -3.693006 -2.894697 -0.991847
O  2.907313 0.685893 -1.006733
O  4.804714 -0.483963 1.86959
O  -5.53938 1.526838 -2.264741
O  5.093225 0.195917 -1.667291
C  1.629893 -0.00831 0.966039
C  0.76278 -0.928887 0.041654
C  -0.701058 -1.049147 0.515445
C  -1.330499 0.385819 0.535412
C  3.03443 -0.159679 0.238372
C  1.004649 1.407207 0.991804
C  -2.873793 0.347055 0.905439
C  1.622256 -2.204801 -0.121619
C  -0.489246 1.346704 1.419886
C  3.092515 -1.671928 -0.140565
C  -1.498614 -2.02455 -0.387971
C  1.761815 -0.562695 2.412047
C  -3.522511 -0.614558 -0.10369
C  -2.99822 -2.030338 -0.032146
C  -3.566589 1.741312 0.810066
C  -3.098194 -0.160276 2.364893
C  4.224853 0.325199 1.099648
C  -3.849526 2.220371 -0.627739
C  -4.383226 -0.226759 -1.094643
C  -4.688475 1.191478 -1.387037
C  4.61417 1.795671 1.056303
C  3.98449 0.729287 -1.898909
C  3.603146 1.495643 -3.14602
H  0.734618 -0.425238 -0.949247
H  -0.706032 -1.459028 1.546033
H  -1.269888 0.764211 -0.510275
H  1.078455 1.857629 -0.015501
H  1.550163 2.068647 1.693341
H  1.378462 -2.758548 -1.044817
H  1.465296 -2.898487 0.726094
H  -0.562472 1.041465 2.481642
H  -0.902195 2.370809 1.359888
H  3.737077 -2.188401 0.590177
H  3.570227 -1.793856 -1.12572
H  -1.100274 -3.051082 -0.296429
H  -1.405371 -1.719827 -1.449319
H  2.322062 0.143261 3.050573
H  0.771227 -0.707058 2.87395
H  2.299001 -1.524306 2.449719
H  -3.174043 -2.494749 0.956688
H  -2.969834 2.494448 1.355491
H  -4.535396 1.671214 1.344203
H  -2.808044 0.625578 3.085351
H  -4.167786 -0.383474 2.530962
H  -2.522334 -1.068004 2.613774
H  -2.904125 2.368764 -1.189597
H  -4.381119 3.18795 -0.634683
H  -4.824648 -0.973438 -1.763418
H  3.766564 2.451049 0.797645
H  5.045672 2.083591 2.028646
H  5.397497 1.931957 0.287255
H  3.108144 2.445653 -2.883907
H  2.886176 0.904266 -3.743778
H  4.500506 1.689495 -3.751089
