program: Gaussian 09
title: 000230780
version: EM64L-G09RevD.01
frameworkgroup: C1[X(C12H10BrClO)]
method: RPBEPBE
basis: SDD
operation: Freq
keyword: #p
keyword: freq=noraman
keyword: PBEPBE/SDD
title: #p freq=noraman PBEPBE/SDD
converged: YES YES NO NO
title: Mulliken charges:
elementType: Br Cl O C C C C C C C C C C C C H H H H H H H H H H
charge: -0.031487 -0.031324 -0.422542 0.513568 0.156786 -0.196282 0.427241 -0.317045 -0.383479 -0.457183 -0.723460 -0.247827 -0.426293 -0.259786 -0.243243 0.235420 0.221331 0.247027 0.295903 0.319256 0.259924 0.244085 0.232647 0.234920 0.351842
chargesum: 0.00000
title: Mulliken charges with hydrogens summed into heavy atoms:
elementType: Br Cl O C C C C C C C C C C C C
charge: -0.031487 -0.031324 -0.070700 0.513568 0.156786 0.039138 0.427241 -0.317045 -0.162148 -0.210156 -0.108301 0.012097 -0.182208 -0.027139 -0.008322
polarizability: 2.25718553e+02 1.56054182e+01 1.91065771e+02 1.23020743e+01 -7.82847227e+00 7.67690022e+01
1716.lowfreq: -6.7187 -5.2310 -0.0024 -0.0023 -0.0021 2.9080 37.4528 47.5703 68.2572
frequency: 37.3961 47.5401 68.2433 110.4332 138.7814 151.5520 195.4829 222.1727 240.9939 265.7575 315.8364 332.8318 346.6063 412.8383 426.2760 472.6865 511.4413 515.5280 539.7715 577.8632 601.3212 643.9411 677.2148 745.3882 752.6039 791.4055 814.6624 822.0009 830.5754 857.2952 878.6638 954.6729 959.7201 973.4836 994.1423 1021.4167 1038.0403 1047.6807 1110.9527 1146.1800 1152.9572 1179.1539 1185.7509 1217.0491 1236.1032 1246.4471 1271.8506 1314.2138 1323.3673 1385.4644 1403.3929 1414.7111 1424.5522 1428.8725 1446.3546 1513.1578 1578.6639 1591.8855 1627.2968 3019.0627 3068.2677 3126.5267 3137.3184 3138.6386 3155.8196 3167.1805 3169.5701 3174.5579 3505.9757
redmass: 9.5112 5.3675 3.7193 5.7038 5.2575 11.4373 6.8131 4.6877 5.2692 7.0279 1.1140 6.6152 6.3152 3.6695 3.1515 3.6432 3.7885 4.9728 5.0471 4.1359 6.7452 5.6111 4.5205 4.0065 1.3610 3.0095 2.5293 1.4286 5.4626 3.3089 1.7360 1.3388 2.2392 1.3978 1.3573 3.3847 2.3050 5.9699 1.6908 1.5431 1.4315 1.2739 1.2541 1.1957 1.8902 1.4278 1.5348 1.9597 1.3963 1.7401 3.0474 3.1881 1.3619 2.0674 2.3634 3.4444 8.1071 6.2119 6.3714 1.0826 1.0570 1.0869 1.0892 1.0888 1.0938 1.1103 1.0999 1.0964 1.0654
irintensity: 0.2045 0.0642 0.8568 0.3782 0.2745 1.7125 6.6402 2.7411 0.1584 5.7543 116.5604 1.8378 16.0059 3.7960 11.3789 23.9904 0.6249 4.0104 23.2351 29.6493 21.0998 8.3880 16.6132 1.8612 41.0209 16.4250 12.6956 49.4804 36.7376 9.2239 15.0433 0.1853 11.7337 2.1280 0.6429 47.5778 14.0155 23.4769 25.9645 37.5917 3.0598 12.0838 4.0539 18.2129 5.1492 26.4134 26.7050 16.2687 5.6104 10.2651 3.7037 5.7460 11.4893 7.2148 7.2792 29.3664 4.5772 18.3835 7.4869 22.9232 5.4996 2.3830 0.5297 10.3783 31.3753 1.6172 26.2420 5.6401 9.6836
temp: 298.150 k
press: 1.00000 atm
elementType: 35 17 8 6 6 6 6 6 6 6 6 6 6 6 6 1 1 1 1 1 1 1 1 1 1
symmnumber: 1
zpe: 485657.3 jmol-1
zpe.correction: 0.184977 hartree
zpe.thermalcorrener: 0.198680 hartree
zpe.thermalcorrenthalpy: 0.199624 hartree
zpe.thermalcorrgfe: 0.142621 hartree
zpe.sumelectzpe: -1010.952071 hartree
zpe.sumelectthermal: -1010.938369 hartree
zpe.sumelectthermalent: -1010.937425 hartree
zpe.sumelectthermalfe: -1010.994427 hartree
dipole: -3.0944 -1.4787 -1.4805
dipole: 3.7354
quadrupole: -93.6533 -98.3656 -109.4496
quadrupole: 0.3082 4.0329 -4.3025
quadrupole: 6.8362 2.1239 -8.9601 0.3082 4.0329 -4.3025
hfenergy: -1011.1370483 hartree
pointgroup: C01 [X(C12H10Br1Cl1O1)]
dipole: -1.3730939 0.209646 0.4801002 debye
dipolederiv: -0.5805462 -0.2807869 -0.0698633 -0.3843382 -0.3702009 -0.0695985 -0.006695 -0.007145 -0.196613 -0.6840924 0.3461762 -0.0442467 0.2660956 -0.310276 0.0094952 -0.0806532 0.0153499 -0.0521988 -0.5592794 0.0655538 0.1102598 0.0958594 -0.3204329 0.0118105 0.1948172 0.0106512 -0.7023689 -0.1886996 0.1512556 0.0050917 0.0455409 -0.1935799 0.0226269 -0.1842365 -0.0999179 -0.0648702 0.1284192 -0.1477408 0.0265448 -0.2498035 -0.0319159 -0.0041442 0.0346331 0.014366 -0.020442 0.4119883 -0.0221323 -0.173361 -0.0821355 0.2680351 0.0209055 -0.0963327 0.0924266 0.5359905 -0.0653615 -0.0966333 0.0205135 -0.0578398 -0.0784499 0.0247886 0.0275918 0.041499 0.0724731 0.951535 -0.526569 0.0442735 -0.2764929 0.3756826 -0.066817 -0.023691 -0.0926751 -0.0498491 -0.1103498 0.113633 -0.031297 0.1382322 0.0139528 -0.0207634 -0.0358876 -0.0465153 -0.1336739 0.0918115 0.0552088 -0.0270243 -0.0934276 0.1186363 -0.0519025 0.0029158 -0.0547067 -0.1549489 0.6676294 0.4521798 -0.0058321 0.5718163 0.4090856 0.0059842 0.048698 0.0052752 -0.0567627 -0.3737087 0.1058299 -0.021152 0.1146959 0.000206 -0.0219306 0.0033268 0.0084834 -0.1009219 0.0931676 0.0169878 -0.0201559 0.1057851 0.0409802 -0.0385728 -0.0297622 -0.0366925 -0.1601544 -0.0381725 0.0375646 -0.0099781 0.0288832 0.14578 -0.0496055 -0.0002872 -0.0484541 -0.1405065 0.107504 -0.0214076 -0.0152754 -0.028703 -0.131021 -0.0043358 -0.013728 -0.0034903 -0.1573308 0.052825 0.0767306 0.0175766 0.0859934 -0.1060226 0.0096549 -0.0113339 0.0095689 -0.009598 0.0019868 -0.1185128 0.0285947 -0.0978451 0.0052126 0.0217048 0.0167136 0.0265716 0.1349381 -0.043313 -0.1029829 0.0258049 -0.0427909 0.0210025 0.0247342 0.0140386 0.0255587 0.1485507 -0.0285342 -0.0198434 0.0912724 -0.0643832 0.0134285 -0.0318348 0.0772617 -0.0205908 0.0008072 -0.0138976 -0.0775556 -0.0081033 0.0317967 -0.0040196 0.0745021 0.0130239 0.0249228 0.0867221 0.0868051 0.0420987 -0.0038416 0.0081232 -0.0346521 0.0336078 0.0039247 0.0353226 0.154577 -0.023057 -0.0543337 0.0181167 -0.1256355 -0.0008738 0.0331218 0.0351303 0.030816 0.1494055 0.0721275 0.0350857 -0.0027356 0.0557891 -0.1068401 0.0444046 -0.0042809 0.0434367 0.1507657 -0.111616 0.0697508 0.0017789 0.0750047 0.0687652 0.0125822 0.0027801 0.0096311 0.1616641 0.1548285 -0.099557 0.0430389 -0.1202208 0.2075175 0.0095819 0.0120325 0.0163078 0.404345 unknown
polarizability: 232.0016472|-2.6617375|185.2536125|2.1460125|-11.6692579|76.2980662 unknown
InChI: InChI=1S/C12H10BrClO/c13-7-11(15)12-9-4-2-1-3-8(9)5-6-10(12)14/h1-6,11,15H,7H2
charge 0 multiplicity 1
25 atoms
Br 4.07137 2.28485 0.64878
Cl 2.410216 -2.365592 0.254116
O  2.577896 0.178068 -1.441099
C  0.591954 -0.209225 -0.102924
C  -0.769262 0.307508 -0.112273
C  1.77419 0.730375 -0.349679
C  -1.883017 -0.600085 0.108429
C  0.761841 -1.578393 0.151551
C  -1.086806 1.694246 -0.329245
C  -1.627593 -1.990004 0.332969
C  2.573576 0.926389 0.953614
C  -0.325161 -2.476657 0.356655
C  -3.227555 -0.103498 0.100104
C  -2.407613 2.150375 -0.330312
C  -3.493605 1.24832 -0.114068
H  1.399015 1.724109 -0.653583
H  -0.291702 2.42504 -0.500167
H  -2.471297 -2.670753 0.49232
H  1.958244 1.361808 1.754907
H  3.088581 0.013662 1.281417
H  -0.116856 -3.534895 0.534862
H  -4.047408 -0.811983 0.267173
H  -2.612065 3.212838 -0.501156
H  -4.523448 1.620221 -0.118483
H  3.422407 0.699873 -1.496307
