program: Gaussian 09
title: 000230778
version: EM64L-G09RevD.01
frameworkgroup: C1[X(C12H9ClO2)]
method: RPBEPBE
basis: SDD
operation: Freq
keyword: #p
keyword: freq=noraman
keyword: PBEPBE/SDD
title: #p freq=noraman PBEPBE/SDD
converged: YES YES NO NO
title: Mulliken charges:
elementType: Cl O O C C C C C C C C C C C C H H H H H H H H H
charge: -0.052971 -0.293260 -0.268364 0.220956 0.421704 0.095994 -0.308279 -0.435023 -0.425441 -0.334022 -0.237473 -0.132380 -0.253292 0.185712 -0.499682 0.328908 0.246888 0.244509 0.281495 0.235730 0.259300 0.231879 0.243464 0.243647
chargesum: 0.00000
title: Mulliken charges with hydrogens summed into heavy atoms:
elementType: Cl O O C C C C C C C C C C C C
charge: -0.052971 -0.293260 -0.268364 0.220956 0.421704 0.095994 0.020630 -0.188135 -0.180931 -0.052527 -0.001743 -0.132380 0.006009 0.185712 0.219308
polarizability: 2.18008335e+02 -1.19164371e+01 1.81342978e+02 -7.20598986e-04 -6.16432580e-03 5.97362923e+01
1716.lowfreq: -5.1871 -0.0019 -0.0015 -0.0008 3.6041 3.6387 30.5505 69.7733 99.7226
frequency: 30.5474 69.7668 99.7223 117.1418 121.6579 167.9407 197.7406 208.1478 283.2525 299.3167 329.1367 341.2249 392.2083 409.8225 473.7777 499.6568 519.8278 545.9313 612.1016 629.1730 651.7089 725.3529 739.7406 761.3404 795.4528 813.3530 826.7574 851.6523 914.2732 935.2058 947.6673 968.5116 1000.1415 1003.8927 1070.4390 1087.0514 1115.6524 1116.5520 1146.7597 1154.4523 1185.2091 1233.4202 1245.3915 1268.0821 1333.4902 1396.1486 1410.9980 1424.4114 1432.4327 1443.1759 1451.4916 1464.1817 1505.5894 1577.4400 1583.5198 1607.5970 1626.6058 3004.5776 3106.1118 3127.5304 3135.1377 3147.6552 3157.0486 3174.4605 3185.7281 3186.2988
redmass: 6.0241 4.7752 1.3181 6.6264 2.8597 4.2024 4.1205 5.5627 5.3200 8.2432 6.5018 6.4420 7.2794 3.4527 5.2296 3.5721 3.7004 6.8417 7.8852 4.0713 6.8417 5.8121 5.7874 1.7798 1.5849 5.7402 6.2418 1.8627 6.8999 1.3997 1.3488 1.4040 1.3894 6.6614 2.4039 2.0907 1.2724 3.5656 1.4479 1.2825 1.3279 1.7269 2.1628 1.7469 2.6090 4.2886 5.5631 1.2627 2.0804 2.9113 1.0494 1.0527 4.6006 7.2023 6.4513 7.5267 7.7086 1.0295 1.1044 1.0887 1.0894 1.1048 1.0944 1.0963 1.0941 1.0936
irintensity: 1.5147 0.2209 1.6715 0.4742 2.3210 1.4943 3.8301 2.6917 0.0052 7.6201 5.9690 16.7542 2.1350 1.6827 5.7700 17.7062 7.4806 5.8939 17.4350 1.2213 2.3419 10.5623 1.8996 22.1642 7.8647 27.3293 33.1191 72.4631 1.4618 20.9829 0.0515 1.4909 2.6861 70.3662 13.4120 36.3741 3.6650 250.1146 59.8228 46.8738 53.0172 46.0240 140.9572 37.4017 0.1224 5.1247 6.1519 22.8182 27.9559 15.8583 14.2112 14.7201 54.6266 44.8889 68.0150 49.4667 94.8669 42.5132 26.1119 2.5161 8.0663 16.7923 21.3479 5.4289 11.4500 19.4212
temp: 298.150 k
press: 1.00000 atm
elementType: 17 8 8 6 6 6 6 6 6 6 6 6 6 6 6 1 1 1 1 1 1 1 1 1
symmnumber: 1
zpe: 462881.8 jmol-1
zpe.correction: 0.176302 hartree
zpe.thermalcorrener: 0.189313 hartree
zpe.thermalcorrenthalpy: 0.190258 hartree
zpe.thermalcorrgfe: 0.135561 hartree
zpe.sumelectzpe: -1072.149864 hartree
zpe.sumelectthermal: -1072.136853 hartree
zpe.sumelectthermalent: -1072.135909 hartree
zpe.sumelectthermalfe: -1072.190606 hartree
dipole: -2.1340 3.2678 -0.0015
dipole: 3.9029
quadrupole: -78.8378 -86.0952 -96.7636
quadrupole: 9.6824 -0.0003 0.0118
quadrupole: 8.3944 1.1370 -9.5314 9.6824 -0.0003 0.0118
hfenergy: -1072.3261668 hartree
pointgroup: C01 [X(C12H9Cl1O2)]
dipole: 0.543566 1.4201814 0.2132518 debye
dipolederiv: -0.3177634 -0.2655055 -0.0558968 -0.4492748 -0.7437717 -0.1219978 -0.0756712 -0.1017479 -0.0890792 -1.8025749 0.2643351 -0.1384843 -0.0211963 -0.4336949 -0.0173765 -0.170651 0.0148452 -0.3141143 -0.7209109 0.0930814 -0.0349963 0.026997 -0.9005483 -0.060938 -0.0424968 -0.0533425 -0.3252609 0.1960501 -0.0143996 0.0190942 0.4228517 0.1031928 0.0567864 0.0662694 0.0083887 0.0166697 -0.0483303 0.063374 -0.0046488 -0.0492581 -0.2567425 -0.0389806 -0.0167125 -0.0265289 0.0506773 -0.3774224 0.1927922 -0.019011 0.4371424 -0.4211672 0.004727 0.0075012 -0.0221444 -0.0193694 -0.4178815 -0.1813469 -0.055395 -0.2411671 -0.2653206 -0.0451422 -0.0618818 -0.0384808 -0.103454 0.235638 -0.0528361 0.0360766 0.1456519 0.1568443 0.0481716 0.0572342 0.0262946 -0.1328118 0.1471919 0.073694 0.0423617 -0.0745662 0.1143379 0.021683 0.0264891 0.0381622 -0.1576032 0.0621485 -0.0265643 0.0151264 -0.3536388 0.078416 -0.0197767 -0.0203956 0.0163722 -0.1015278 -0.4187343 0.0919458 -0.0179513 0.1204857 0.1106979 0.0430636 -0.014891 0.0400412 -0.1636023 0.450275 0.3834813 0.0987759 0.5686154 1.1701275 0.1960892 0.1187911 0.1757397 -0.0390187 0.0088996 -0.1144867 0.0004 -0.1417837 -0.3791026 -0.0449791 -0.0026389 -0.0419824 -0.1111613 2.1020747 -0.3966071 0.1645458 -0.2145709 1.1496142 0.0760459 0.1846959 0.0552052 0.2616509 0.7132692 -0.1620828 0.0303123 -0.2927329 0.3210704 -0.0274511 0.0171992 -0.0130933 0.2790069 0.2284633 0.040363 0.0108958 -0.0220883 0.0843748 -0.011468 0.0041387 -0.0046565 0.1685869 0.0065535 0.1288944 -0.0021547 0.0571744 -0.0169794 -0.0117501 -0.0098198 -0.0039031 0.1497573 0.020632 0.0397525 -0.0106204 0.1060651 -0.0505458 -0.0103657 -0.0034705 -0.0177121 0.1530862 0.0011472 -0.0332047 -0.0202341 -0.0559531 0.1246688 -0.009186 -0.0226007 -0.0067245 0.1495127 0.0571512 -0.0729435 -0.0192886 -0.0528629 -0.0953334 -0.0333771 -0.0170597 -0.0355851 0.155047 -0.0478656 -0.0147595 -0.0252544 -0.0344445 0.1014552 -0.0107863 -0.0273606 -0.0086345 0.1627317 -0.10794 -0.0378645 -0.0303769 -0.10839 0.039753 -0.0217246 -0.0382905 -0.013635 0.1150918 0.0180043 0.0158239 -0.0351877 0.1220051 0.0239894 -0.0669798 0.0362433 -0.080838 -0.0761099 0.0119247 -0.0149363 0.0519118 0.1049391 -0.0153356 0.1057129 0.0053786 0.09396 -0.0287055 unknown
polarizability: 209.5895238|16.4847355|186.0826607|18.3186865|15.4054414|63.4154209 unknown
InChI: InChI=1S/C12H9ClO2/c1-15-12(14)10-4-2-3-8-5-6-9(13)7-11(8)10/h2-7H,1H3
charge 0 multiplicity 1
24 atoms
Cl -3.133194 -3.046116 -0.582658
O  3.237917 -0.343821 0.412344
O  1.700836 -2.041298 0.056555
C  -0.487969 0.054834 0.042497
C  -1.386396 1.197821 0.06588
C  0.932459 0.298805 0.225688
C  -1.05345 -1.250704 -0.160002
C  -0.86598 2.516192 0.26492
C  -2.795566 0.99607 -0.111558
C  1.394525 1.615032 0.418095
C  0.503512 2.722975 0.438703
C  -2.428165 -1.382992 -0.32605
C  -3.326348 -0.277879 -0.306694
C  1.929954 -0.813921 0.215717
C  4.288419 -1.386673 0.415484
H  -0.394095 -2.120021 -0.180824
H  -1.562928 3.362547 0.27879
H  -3.460455 1.86705 -0.091614
H  2.466657 1.77516 0.553299
H  0.899246 3.732085 0.590933
H  -4.399731 -0.43627 -0.442084
H  5.225533 -0.83793 0.584733
H  4.305571 -1.916417 -0.551834
H  4.102147 -2.116429 1.221283
