program: Gaussian 09
title: 000230760
version: EM64L-G09RevD.01
frameworkgroup: C1[X(C15H13NO2)]
method: RPBEPBE
basis: SDD
operation: Freq
keyword: #p
keyword: freq=noraman
keyword: PBEPBE/SDD
title: #p freq=noraman PBEPBE/SDD
converged: YES YES NO NO
title: Mulliken charges:
elementType: O O N C C C C C C C C C C C C C C C H H H H H H H H H H H H H
charge: -0.446294 -0.261383 -0.685058 0.531651 0.534916 -0.344834 -0.326896 -0.390044 -0.408737 0.245990 -0.382939 -0.400659 -0.340538 -0.371312 0.489447 -0.421856 -0.428208 0.098126 0.215832 0.217040 0.222884 0.228879 0.222824 0.225588 0.269862 0.267858 0.218076 0.219006 0.310362 0.310106 0.380313
chargesum: 0.00000
title: Mulliken charges with hydrogens summed into heavy atoms:
elementType: O O N C C C C C C C C C C C C C C C
charge: -0.065981 -0.261383 -0.064590 0.531651 0.534916 -0.129002 -0.109856 -0.167160 -0.179858 0.245990 -0.160115 -0.175071 -0.070677 -0.103454 0.489447 -0.203780 -0.209203 0.098126
polarizability: 5.37186435e+02 9.20439474e+00 1.68510857e+02 -1.86484661e-02 3.42798172e-02 6.86504401e+01
1716.lowfreq: -4.9529 -2.7715 -0.0010 0.0002 0.0006 5.4541 25.1601 30.8565 53.0999
frequency: 25.1213 30.8541 53.0953 71.5622 77.8586 146.7024 151.4139 187.6668 189.4530 258.1290 293.2468 361.4052 365.0800 382.5487 389.0950 394.4493 408.9041 411.0138 455.2548 488.0847 499.9719 520.3150 530.7667 583.3260 598.2430 631.3629 639.8832 685.3192 724.0892 732.2413 764.0770 795.0961 812.1177 823.8206 830.6272 846.1978 851.5489 867.0206 898.2750 944.1042 956.5131 975.9741 991.6169 994.2920 994.8229 997.0950 1017.6572 1018.4842 1119.9579 1132.9470 1149.0829 1190.4406 1198.5362 1209.1033 1249.6037 1296.5329 1302.2285 1319.1241 1323.1459 1331.3131 1335.6752 1379.4572 1394.8024 1429.1896 1451.0739 1499.9446 1524.7186 1556.1453 1567.6171 1601.7900 1632.3525 1635.4531 1641.1550 1649.2027 3087.5661 3099.6890 3113.8991 3118.0534 3124.8003 3137.7014 3139.6332 3147.9191 3160.3868 3174.2630 3531.8977 3561.9647 3702.0751
redmass: 4.0535 6.1572 5.6951 5.7179 5.8112 6.2608 4.3845 7.8135 2.8379 4.9842 3.3463 2.9840 3.2925 6.2159 1.1162 1.2270 2.8778 2.8761 5.0828 2.6212 4.6371 6.6260 2.3216 1.2333 5.0219 7.1259 6.8152 3.5303 5.2807 3.1322 3.9694 4.7989 1.2894 1.6942 5.6891 1.2921 1.6974 4.3394 2.0381 1.3851 1.3699 1.2391 1.3240 1.3490 4.7016 2.7651 2.5831 1.5022 1.3954 1.2887 1.6662 1.1628 1.2408 2.1962 1.3167 2.0650 1.4904 2.6368 1.5651 3.6580 1.3079 4.1340 3.3790 4.2580 3.9783 2.6450 3.1455 6.7967 6.1568 5.4158 4.9788 2.9661 2.3657 2.7929 1.0909 1.0863 1.0868 1.0876 1.0889 1.0962 1.0885 1.0960 1.0952 1.0955 1.0641 1.0450 1.1040
irintensity: 0.2506 0.6883 0.4638 2.0523 0.0819 0.5553 0.2977 0.1941 1.8709 1.6984 0.4976 43.4794 3.3041 33.6746 107.0010 171.9110 0.0847 0.1838 3.9645 11.2115 9.0115 3.1167 63.7761 66.9769 49.0289 0.7242 0.8545 78.9911 2.8889 4.8778 3.7995 2.4083 0.8472 47.1506 1.3847 0.9736 66.3843 1.4587 8.4042 12.9245 0.0301 46.4600 5.1929 5.0233 259.4928 1.3477 209.2659 18.9781 10.7848 21.5504 349.1396 124.5974 17.6330 9.8230 6.2596 5.3583 3.7211 315.7937 25.0492 73.4850 36.7279 8.8593 17.3471 10.9185 19.8384 9.7380 159.0886 148.3751 5.1372 1313.7372 149.7237 265.2858 37.5955 246.9917 0.8973 38.6288 15.3412 21.1828 13.0459 36.7019 13.0579 15.6501 6.7929 2.6493 66.8609 205.9992 22.9913
temp: 298.150 k
press: 1.00000 atm
elementType: 8 8 7 6 6 6 6 6 6 6 6 6 6 6 6 6 6 6 1 1 1 1 1 1 1 1 1 1 1 1 1
symmnumber: 1
zpe: 633340.4 jmol-1
zpe.correction: 0.241227 hartree
zpe.thermalcorrener: 0.257123 hartree
zpe.thermalcorrenthalpy: 0.258067 hartree
zpe.thermalcorrgfe: 0.196323 hartree
zpe.sumelectzpe: -783.357818 hartree
zpe.sumelectthermal: -783.341922 hartree
zpe.sumelectthermalent: -783.340978 hartree
zpe.sumelectthermalfe: -783.402722 hartree
dipole: 7.6009 1.0224 -0.0036
dipole: 7.6693
quadrupole: -73.6864 -92.8051 -113.2578
quadrupole: -12.1689 0.0712 0.0495
quadrupole: 19.5634 0.4447 -20.0081 -12.1689 0.0712 0.0495
hfenergy: -783.5990451 hartree
pointgroup: C01 [X(C15H13N1O2)]
dipole: -2.994512 -0.3689631 -0.0338749 debye
polarizability: 537.333909|5.1570833|168.0359725|2.1048664|5.6430882|68.9778504 unknown
InChI: InChI=1S/C15H13NO2/c16-14-9-5-12(6-10-14)2-1-11-3-7-13(8-4-11)15(17)18/h1-10,17H,16H2
charge 0 multiplicity 1
31 atoms
O  5.94076 -1.463637 -0.04978
O  6.321874 0.823382 0.092131
N  -6.948295 0.219052 0.00078
C  1.178616 0.308634 0.036912
C  -2.697566 -0.218851 -0.006857
C  -0.26909 0.536108 0.043733
C  -1.249527 -0.427035 -0.012288
C  1.778316 -0.988149 -0.038335
C  2.052664 1.437942 0.108252
C  4.025046 -0.008759 0.030307
C  -3.315503 1.067764 0.058672
C  -3.565223 -1.350196 -0.069426
C  3.172007 -1.145201 -0.041812
C  3.447596 1.287048 0.105514
C  -5.56387 0.071398 -0.001781
C  -4.708741 1.215134 0.061428
C  -4.962514 -1.219976 -0.067489
C  5.499339 -0.126391 0.03006
H  -0.569678 1.591903 0.10001
H  -0.939986 -1.481068 -0.067398
H  1.14527 -1.879884 -0.095216
H  1.616705 2.442716 0.166654
H  -2.694209 1.96875 0.108346
H  -3.12447 -2.353902 -0.120814
H  3.621074 -2.140793 -0.100139
H  4.112866 2.155048 0.160676
H  -5.152604 2.217167 0.112611
H  -5.597566 -2.112864 -0.116788
H  -7.374624 1.140013 0.048664
H  -7.559557 -0.591282 -0.043247
H  6.935192 -1.461672 -0.044879
